{"text_format":"1","workbook":"xlsx","n_sheets":4,"sheets":["Import model","Calculator","Dictionary","Month mapping"],"not_rendered":{"charts":0,"images":0,"macros":1,"external_links":0,"defined_names":26,"comments":0,"pivot_tables":0},"unopened":[],"bounds":{"document_bytes":16777216,"sheet_cells":100000,"rows_first":2000,"rows_last":500,"rows_between":2000,"halvings":0,"cell_chars":16384,"cell_head_chars":4096},"cells_cut":0,"cells_raw":0,"read":"whole","date_system":"1900"}

{"sheet":"Import model","index":0,"n_rows":799,"n_cols":8,"rows_kept":799,"cut":false,"hidden":false,"merged":[]}
["Year","Month","N°","Monthly payment","Interest","Insurance","Principal / Month","Balance"]
[{"$f":"IFERROR(YEAR(Calculator!C30),\"\")","v":2020},{"$f":"IFERROR(VLOOKUP(MONTH(Calculator!C30),'Month mapping'!A:B,2,0),\"\")","v":"Aug"},{"$f":"Calculator!D30","v":1},{"$f":"Calculator!E30","v":5895.1824131577205},{"$f":"Calculator!G30","v":333.33333333333331},{"$f":"Calculator!H30","v":166.66666666666666},{"$f":"Calculator!I30","v":5395.1824131577205},{"$f":"Calculator!J30","v":194604.81758684228}]
[{"$f":"IFERROR(YEAR(Calculator!C31),\"\")","v":2020},{"$f":"IFERROR(VLOOKUP(MONTH(Calculator!C31),'Month mapping'!A:B,2,0),\"\")","v":"Sep"},{"$f":"Calculator!D31","v":2},{"$f":"Calculator!E31","v":5895.1824131577205},{"$f":"Calculator!G31","v":324.3413626447371},{"$f":"Calculator!H31","v":166.66666666666666},{"$f":"Calculator!I31","v":5404.1743838463162},{"$f":"Calculator!J31","v":189200.64320299597}]
[{"$f":"IFERROR(YEAR(Calculator!C32),\"\")","v":2020},{"$f":"IFERROR(VLOOKUP(MONTH(Calculator!C32),'Month mapping'!A:B,2,0),\"\")","v":"Oct"},{"$f":"Calculator!D32","v":3},{"$f":"Calculator!E32","v":5895.1824131577205},{"$f":"Calculator!G32","v":315.33440533832663},{"$f":"Calculator!H32","v":166.66666666666666},{"$f":"Calculator!I32","v":5413.1813411527273},{"$f":"Calculator!J32","v":183787.46186184324}]
[{"$f":"IFERROR(YEAR(Calculator!C33),\"\")","v":2020},{"$f":"IFERROR(VLOOKUP(MONTH(Calculator!C33),'Month mapping'!A:B,2,0),\"\")","v":"Nov"},{"$f":"Calculator!D33","v":4},{"$f":"Calculator!E33","v":5895.1824131577205},{"$f":"Calculator!G33","v":306.31243643640539},{"$f":"Calculator!H33","v":166.66666666666666},{"$f":"Calculator!I33","v":5422.2033100546478},{"$f":"Calculator!J33","v":178365.2585517886}]
[{"$f":"IFERROR(YEAR(Calculator!C34),\"\")","v":2020},{"$f":"IFERROR(VLOOKUP(MONTH(Calculator!C34),'Month mapping'!A:B,2,0),\"\")","v":"Dec"},{"$f":"Calculator!D34","v":5},{"$f":"Calculator!E34","v":5895.1824131577205},{"$f":"Calculator!G34","v":297.2754309196477},{"$f":"Calculator!H34","v":166.66666666666666},{"$f":"Calculator!I34","v":5431.2403155714055},{"$f":"Calculator!J34","v":172934.01823621721}]
[{"$f":"IFERROR(YEAR(Calculator!C35),\"\")","v":2021},{"$f":"IFERROR(VLOOKUP(MONTH(Calculator!C35),'Month mapping'!A:B,2,0),\"\")","v":"Jan"},{"$f":"Calculator!D35","v":6},{"$f":"Calculator!E35","v":5895.1824131577205},{"$f":"Calculator!G35","v":288.2233637270287},{"$f":"Calculator!H35","v":166.66666666666666},{"$f":"Calculator!I35","v":5440.2923827640252},{"$f":"Calculator!J35","v":167493.72585345319}]
[{"$f":"IFERROR(YEAR(Calculator!C36),\"\")","v":2021},{"$f":"IFERROR(VLOOKUP(MONTH(Calculator!C36),'Month mapping'!A:B,2,0),\"\")","v":"Feb"},{"$f":"Calculator!D36","v":7},{"$f":"Calculator!E36","v":5895.1824131577205},{"$f":"Calculator!G36","v":279.1562097557553},{"$f":"Calculator!H36","v":166.66666666666666},{"$f":"Calculator!I36","v":5449.3595367352982},{"$f":"Calculator!J36","v":162044.36631671787}]
[{"$f":"IFERROR(YEAR(Calculator!C37),\"\")","v":2021},{"$f":"IFERROR(VLOOKUP(MONTH(Calculator!C37),'Month mapping'!A:B,2,0),\"\")","v":"Mar"},{"$f":"Calculator!D37","v":8},{"$f":"Calculator!E37","v":5895.1824131577205},{"$f":"Calculator!G37","v":270.07394386119648},{"$f":"Calculator!H37","v":166.66666666666666},{"$f":"Calculator!I37","v":5458.4418026298572},{"$f":"Calculator!J37","v":156585.92451408802}]
[{"$f":"IFERROR(YEAR(Calculator!C38),\"\")","v":2021},{"$f":"IFERROR(VLOOKUP(MONTH(Calculator!C38),'Month mapping'!A:B,2,0),\"\")","v":"Apr"},{"$f":"Calculator!D38","v":9},{"$f":"Calculator!E38","v":5895.1824131577205},{"$f":"Calculator!G38","v":260.97654085681336},{"$f":"Calculator!H38","v":166.66666666666666},{"$f":"Calculator!I38","v":5467.5392056342398},{"$f":"Calculator!J38","v":151118.38530845378}]
[{"$f":"IFERROR(YEAR(Calculator!C39),\"\")","v":2021},{"$f":"IFERROR(VLOOKUP(MONTH(Calculator!C39),'Month mapping'!A:B,2,0),\"\")","v":"May"},{"$f":"Calculator!D39","v":10},{"$f":"Calculator!E39","v":5895.1824131577205},{"$f":"Calculator!G39","v":251.86397551408962},{"$f":"Calculator!H39","v":166.66666666666666},{"$f":"Calculator!I39","v":5476.6517709769641},{"$f":"Calculator!J39","v":145641.7335374768}]
[{"$f":"IFERROR(YEAR(Calculator!C40),\"\")","v":2021},{"$f":"IFERROR(VLOOKUP(MONTH(Calculator!C40),'Month mapping'!A:B,2,0),\"\")","v":"Jun"},{"$f":"Calculator!D40","v":11},{"$f":"Calculator!E40","v":5895.1824131577205},{"$f":"Calculator!G40","v":242.73622256246134},{"$f":"Calculator!H40","v":166.66666666666666},{"$f":"Calculator!I40","v":5485.7795239285924},{"$f":"Calculator!J40","v":140155.95401354821}]
[{"$f":"IFERROR(YEAR(Calculator!C41),\"\")","v":2021},{"$f":"IFERROR(VLOOKUP(MONTH(Calculator!C41),'Month mapping'!A:B,2,0),\"\")","v":"Jul"},{"$f":"Calculator!D41","v":12},{"$f":"Calculator!E41","v":5895.1824131577205},{"$f":"Calculator!G41","v":233.59325668924703},{"$f":"Calculator!H41","v":166.66666666666666},{"$f":"Calculator!I41","v":5494.9224898018065},{"$f":"Calculator!J41","v":134661.03152374641}]
[{"$f":"IFERROR(YEAR(Calculator!C42),\"\")","v":2021},{"$f":"IFERROR(VLOOKUP(MONTH(Calculator!C42),'Month mapping'!A:B,2,0),\"\")","v":"Aug"},{"$f":"Calculator!D42","v":13},{"$f":"Calculator!E42","v":5895.1824131577205},{"$f":"Calculator!G42","v":224.43505253957736},{"$f":"Calculator!H42","v":166.66666666666666},{"$f":"Calculator!I42","v":5504.080693951476},{"$f":"Calculator!J42","v":129156.95082979492}]
[{"$f":"IFERROR(YEAR(Calculator!C43),\"\")","v":2021},{"$f":"IFERROR(VLOOKUP(MONTH(Calculator!C43),'Month mapping'!A:B,2,0),\"\")","v":"Sep"},{"$f":"Calculator!D43","v":14},{"$f":"Calculator!E43","v":5895.1824131577205},{"$f":"Calculator!G43","v":215.26158471632485},{"$f":"Calculator!H43","v":166.66666666666666},{"$f":"Calculator!I43","v":5513.2541617747283},{"$f":"Calculator!J43","v":123643.69666802019}]
[{"$f":"IFERROR(YEAR(Calculator!C44),\"\")","v":2021},{"$f":"IFERROR(VLOOKUP(MONTH(Calculator!C44),'Month mapping'!A:B,2,0),\"\")","v":"Oct"},{"$f":"Calculator!D44","v":15},{"$f":"Calculator!E44","v":5895.1824131577205},{"$f":"Calculator!G44","v":206.07282778003366},{"$f":"Calculator!H44","v":166.66666666666666},{"$f":"Calculator!I44","v":5522.44291871102},{"$f":"Calculator!J44","v":118121.25374930917}]
[{"$f":"IFERROR(YEAR(Calculator!C45),\"\")","v":2021},{"$f":"IFERROR(VLOOKUP(MONTH(Calculator!C45),'Month mapping'!A:B,2,0),\"\")","v":"Nov"},{"$f":"Calculator!D45","v":16},{"$f":"Calculator!E45","v":5895.1824131577205},{"$f":"Calculator!G45","v":196.86875624884863},{"$f":"Calculator!H45","v":166.66666666666666},{"$f":"Calculator!I45","v":5531.646990242205},{"$f":"Calculator!J45","v":112589.60675906696}]
[{"$f":"IFERROR(YEAR(Calculator!C46),\"\")","v":2021},{"$f":"IFERROR(VLOOKUP(MONTH(Calculator!C46),'Month mapping'!A:B,2,0),\"\")","v":"Dec"},{"$f":"Calculator!D46","v":17},{"$f":"Calculator!E46","v":5895.1824131577205},{"$f":"Calculator!G46","v":187.64934459844494},{"$f":"Calculator!H46","v":166.66666666666666},{"$f":"Calculator!I46","v":5540.8664018926083},{"$f":"Calculator!J46","v":107048.74035717433}]
[{"$f":"IFERROR(YEAR(Calculator!C47),\"\")","v":2022},{"$f":"IFERROR(VLOOKUP(MONTH(Calculator!C47),'Month mapping'!A:B,2,0),\"\")","v":"Jan"},{"$f":"Calculator!D47","v":18},{"$f":"Calculator!E47","v":5895.1824131577205},{"$f":"Calculator!G47","v":178.41456726195722},{"$f":"Calculator!H47","v":166.66666666666666},{"$f":"Calculator!I47","v":5550.1011792290965},{"$f":"Calculator!J47","v":101498.63917794524}]
[{"$f":"IFERROR(YEAR(Calculator!C48),\"\")","v":2022},{"$f":"IFERROR(VLOOKUP(MONTH(Calculator!C48),'Month mapping'!A:B,2,0),\"\")","v":"Feb"},{"$f":"Calculator!D48","v":19},{"$f":"Calculator!E48","v":5895.1824131577205},{"$f":"Calculator!G48","v":169.16439862990873},{"$f":"Calculator!H48","v":166.66666666666666},{"$f":"Calculator!I48","v":5559.3513478611449},{"$f":"Calculator!J48","v":95939.287830084082}]
[{"$f":"IFERROR(YEAR(Calculator!C49),\"\")","v":2022},{"$f":"IFERROR(VLOOKUP(MONTH(Calculator!C49),'Month mapping'!A:B,2,0),\"\")","v":"Mar"},{"$f":"Calculator!D49","v":20},{"$f":"Calculator!E49","v":5895.1824131577205},{"$f":"Calculator!G49","v":159.89881305014015},{"$f":"Calculator!H49","v":166.66666666666666},{"$f":"Calculator!I49","v":5568.6169334409133},{"$f":"Calculator!J49","v":90370.670896643162}]
[{"$f":"IFERROR(YEAR(Calculator!C50),\"\")","v":2022},{"$f":"IFERROR(VLOOKUP(MONTH(Calculator!C50),'Month mapping'!A:B,2,0),\"\")","v":"Apr"},{"$f":"Calculator!D50","v":21},{"$f":"Calculator!E50","v":5895.1824131577205},{"$f":"Calculator!G50","v":150.6177848277386},{"$f":"Calculator!H50","v":166.66666666666666},{"$f":"Calculator!I50","v":5577.8979616633151},{"$f":"Calculator!J50","v":84792.772934979846}]
[{"$f":"IFERROR(YEAR(Calculator!C51),\"\")","v":2022},{"$f":"IFERROR(VLOOKUP(MONTH(Calculator!C51),'Month mapping'!A:B,2,0),\"\")","v":"May"},{"$f":"Calculator!D51","v":22},{"$f":"Calculator!E51","v":5895.1824131577205},{"$f":"Calculator!G51","v":141.32128822496642},{"$f":"Calculator!H51","v":166.66666666666666},{"$f":"Calculator!I51","v":5587.1944582660872},{"$f":"Calculator!J51","v":79205.578476713752}]
[{"$f":"IFERROR(YEAR(Calculator!C52),\"\")","v":2022},{"$f":"IFERROR(VLOOKUP(MONTH(Calculator!C52),'Month mapping'!A:B,2,0),\"\")","v":"Jun"},{"$f":"Calculator!D52","v":23},{"$f":"Calculator!E52","v":5895.1824131577205},{"$f":"Calculator!G52","v":132.00929746118959},{"$f":"Calculator!H52","v":166.66666666666666},{"$f":"Calculator!I52","v":5596.5064490298637},{"$f":"Calculator!J52","v":73609.072027683884}]
[{"$f":"IFERROR(YEAR(Calculator!C53),\"\")","v":2022},{"$f":"IFERROR(VLOOKUP(MONTH(Calculator!C53),'Month mapping'!A:B,2,0),\"\")","v":"Jul"},{"$f":"Calculator!D53","v":24},{"$f":"Calculator!E53","v":5895.1824131577205},{"$f":"Calculator!G53","v":122.68178671280647},{"$f":"Calculator!H53","v":166.66666666666666},{"$f":"Calculator!I53","v":5605.8339597782469},{"$f":"Calculator!J53","v":68003.238067905637}]
[{"$f":"IFERROR(YEAR(Calculator!C54),\"\")","v":2022},{"$f":"IFERROR(VLOOKUP(MONTH(Calculator!C54),'Month mapping'!A:B,2,0),\"\")","v":"Aug"},{"$f":"Calculator!D54","v":25},{"$f":"Calculator!E54","v":5895.1824131577205},{"$f":"Calculator!G54","v":113.33873011317606},{"$f":"Calculator!H54","v":166.66666666666666},{"$f":"Calculator!I54","v":5615.1770163778774},{"$f":"Calculator!J54","v":62388.061051527759}]
[{"$f":"IFERROR(YEAR(Calculator!C55),\"\")","v":2022},{"$f":"IFERROR(VLOOKUP(MONTH(Calculator!C55),'Month mapping'!A:B,2,0),\"\")","v":"Sep"},{"$f":"Calculator!D55","v":26},{"$f":"Calculator!E55","v":5895.1824131577205},{"$f":"Calculator!G55","v":103.98010175254626},{"$f":"Calculator!H55","v":166.66666666666666},{"$f":"Calculator!I55","v":5624.5356447385075},{"$f":"Calculator!J55","v":56763.525406789253}]
[{"$f":"IFERROR(YEAR(Calculator!C56),\"\")","v":2022},{"$f":"IFERROR(VLOOKUP(MONTH(Calculator!C56),'Month mapping'!A:B,2,0),\"\")","v":"Oct"},{"$f":"Calculator!D56","v":27},{"$f":"Calculator!E56","v":5895.1824131577205},{"$f":"Calculator!G56","v":94.605875677982098},{"$f":"Calculator!H56","v":166.66666666666666},{"$f":"Calculator!I56","v":5633.9098708130714},{"$f":"Calculator!J56","v":51129.615535976183}]
[{"$f":"IFERROR(YEAR(Calculator!C57),\"\")","v":2022},{"$f":"IFERROR(VLOOKUP(MONTH(Calculator!C57),'Month mapping'!A:B,2,0),\"\")","v":"Nov"},{"$f":"Calculator!D57","v":28},{"$f":"Calculator!E57","v":5895.1824131577205},{"$f":"Calculator!G57","v":85.216025893293633},{"$f":"Calculator!H57","v":166.66666666666666},{"$f":"Calculator!I57","v":5643.2997205977599},{"$f":"Calculator!J57","v":45486.315815378424}]
[{"$f":"IFERROR(YEAR(Calculator!C58),\"\")","v":2022},{"$f":"IFERROR(VLOOKUP(MONTH(Calculator!C58),'Month mapping'!A:B,2,0),\"\")","v":"Dec"},{"$f":"Calculator!D58","v":29},{"$f":"Calculator!E58","v":5895.1824131577205},{"$f":"Calculator!G58","v":75.81052635896404},{"$f":"Calculator!H58","v":166.66666666666666},{"$f":"Calculator!I58","v":5652.7052201320894},{"$f":"Calculator!J58","v":39833.610595246333}]
{"$rows_left_out":770}
{"sheet":"Calculator","index":1,"n_rows":1000,"n_cols":11,"rows_kept":1000,"cut":false,"hidden":false,"merged":[[0,2,0,6]]}
[null,null,{"$f":"INDIRECT(\"'Dictionary'!R\"&MATCH(\"Mortgage calculator\",Dictionary!A:A,0)&\"C\"&LangCol,FALSE)","v":"Tabla de amortización"}]
[null,{"$f":"IF(AND(mois<>\"\",annee<>\"\",annee>0,pret<>\"\",pret>0,dureepret<>\"\",dureepret>0,tauxinteret<>\"\",tauxinteret>0),\"OK\",\"NOK\")","v":"OK"},{"$f":"INDIRECT(\"'Dictionary'!R\"&MATCH(\"Mortgage data\",Dictionary!A:A,0)&\"C\"&LangCol,FALSE)","v":"Datos de prestamo"}]
[]
[null,null,null,{"$f":"INDIRECT(\"'Dictionary'!R\"&MATCH(\"Start date\",Dictionary!A:A,0)&\"C\"&LangCol,FALSE)","v":"Fecha de inicio"},"agosto",2020,null,null,"Language:","Espanol",{"$f":"MATCH(J4,Dictionary!1:1,0)","v":6}]
[null,null,null,null,{"$f":"INDEX(Dictionary!A:A,MATCH(Calculator!mois,INDIRECT(\"Dictionary!R1C\"&LangCol&\":R100C\"&LangCol,FALSE),0))","v":"August"}]
[null,null,null,{"$f":"INDIRECT(\"'Dictionary'!R\"&MATCH(\"Mortgage amount\",Dictionary!A:A,0)&\"C\"&LangCol,FALSE)","v":"Importe del préstamo"},200000,{"$f":"INDIRECT(\"'Dictionary'!R\"&MATCH(\"£\",Dictionary!A:A,0)&\"C\"&LangCol,FALSE)","v":"€"}]
[]
[null,null,null,{"$f":"INDIRECT(\"'Dictionary'!R\"&MATCH(\"Mortgage term\",Dictionary!A:A,0)&\"C\"&LangCol,FALSE)","v":"Duración"},36,{"$f":"INDIRECT(\"'Dictionary'!R\"&MATCH(\"months\",Dictionary!A:A,0)&\"C\"&LangCol,FALSE)","v":"mes"}]
[]
[null,null,null,{"$f":"INDIRECT(\"'Dictionary'!R\"&MATCH(\"Interest rate per year\",Dictionary!A:A,0)&\"C\"&LangCol,FALSE)","v":"Tasa de interés"},2," %"]
[]
[null,null,null,{"$f":"INDIRECT(\"'Dictionary'!R\"&MATCH(\"Insurance rate\",Dictionary!A:A,0)&\"C\"&LangCol,FALSE)","v":"Tasa de seguro"},1,{"$f":"INDIRECT(\"'Dictionary'!R\"&MATCH(\"% of borrowed amount\",Dictionary!A:A,0)&\"C\"&LangCol,FALSE)","v":"% de la cantidad prestada"}]
[]
[null,{"$f":"IF(AND(OR(typediffere=3,typediffere=2),dureediffere>0,dureediffere<dureepret),\"OK\",IF(AND(typediffere=1,dureediffere>=0),\"OK\",\"NOK\"))","v":"OK"},{"$f":"INDIRECT(\"'Dictionary'!R\"&MATCH(\"Deferred repayment\",Dictionary!A:A,0)&\"C\"&LangCol,FALSE)","v":"Pago diferido"}]
[]
[null,null,null,null,{"$f":"INDIRECT(\"'Dictionary'!R\"&MATCH(\"Without delay\",Dictionary!A:A,0)&\"C\"&LangCol,FALSE)","v":"Sin"}]
[null,1,null,{"$f":"INDIRECT(\"'Dictionary'!R\"&MATCH(\"Type\",Dictionary!A:A,0)&\"C\"&LangCol,FALSE)","v":"Tipo diferido"},{"$f":"INDIRECT(\"'Dictionary'!R\"&MATCH(\"Partial (with interest payment)\",Dictionary!A:A,0)&\"C\"&LangCol,FALSE)","v":"Parcial (con pago de intereses)"}]
[null,null,null,null,{"$f":"INDIRECT(\"'Dictionary'!R\"&MATCH(\"Total (without interest payment)\",Dictionary!A:A,0)&\"C\"&LangCol,FALSE)","v":"Total (sin pago de intereses)"}]
[]
[null,null,null,{"$f":"INDIRECT(\"'Dictionary'!R\"&MATCH(\"Duration\",Dictionary!A:A,0)&\"C\"&LangCol,FALSE)","v":"Duración del diferido"},null,{"$f":"INDIRECT(\"'Dictionary'!R\"&MATCH(\"months\",Dictionary!A:A,0)&\"C\"&LangCol,FALSE)","v":"mes"}]
[]
[null,null,{"$f":"INDIRECT(\"'Dictionary'!R\"&MATCH(\"Mortgage cost\",Dictionary!A:A,0)&\"C\"&LangCol,FALSE)","v":"Costo total del préstamo"}]
[]
[null,null,null,{"$f":"INDIRECT(\"'Dictionary'!R\"&MATCH(\"Total Interest\",Dictionary!A:A,0)&\"C\"&LangCol,FALSE)","v":"Costo de interés"},{"$f":"IF(AND(test=\"OK\",test2=\"OK\"),SUM(G30:G1000),0)","v":6226.5668736861753},{"$f":"INDIRECT(\"'Dictionary'!R\"&MATCH(\"£\",Dictionary!A:A,0)&\"C\"&LangCol,FALSE)","v":"€"}]
[null,null,null,{"$f":"INDIRECT(\"'Dictionary'!R\"&MATCH(\"Total insurance\",Dictionary!A:A,0)&\"C\"&LangCol,FALSE)","v":"Costo del seguro"},{"$f":"IF(AND(test=\"OK\",test2=\"OK\"),pret*tauxassurance*0.01*dureepret/12,0)","v":6000},{"$f":"INDIRECT(\"'Dictionary'!R\"&MATCH(\"£\",Dictionary!A:A,0)&\"C\"&LangCol,FALSE)","v":"€"}]
[null,null,null,{"$f":"INDIRECT(\"'Dictionary'!R\"&MATCH(\"Total cost\",Dictionary!A:A,0)&\"C\"&LangCol,FALSE)","v":"Costo total del préstamo"},{"$f":"IF(AND(test=\"OK\",test2=\"OK\"),E24+E25,0)","v":12226.566873686175},{"$f":"INDIRECT(\"'Dictionary'!R\"&MATCH(\"£\",Dictionary!A:A,0)&\"C\"&LangCol,FALSE)","v":"€"}]
[]
[null,null,{"$f":"INDIRECT(\"'Dictionary'!R\"&MATCH(\"Amortization schedule calculator\",Dictionary!A:A,0)&\"C\"&LangCol,FALSE)","v":"Tabla de amortización"}]
[null,0,{"$f":"INDIRECT(\"'Dictionary'!R\"&MATCH(\"Date\",Dictionary!A:A,0)&\"C\"&LangCol,FALSE)","v":"Fecha"},{"$f":"INDIRECT(\"'Dictionary'!R\"&MATCH(\"No.\",Dictionary!A:A,0)&\"C\"&LangCol,FALSE)","v":"Cantidad de pagos"},{"$f":"INDIRECT(\"'Dictionary'!R\"&MATCH(\"Monthly payment with insurance\",Dictionary!A:A,0)&\"C\"&LangCol,FALSE)","v":"Pago mensual con seguro"},{"$f":"INDIRECT(\"'Dictionary'!R\"&MATCH(\"Monthly payment without insurance\",Dictionary!A:A,0)&\"C\"&LangCol,FALSE)","v":"Pago mensual sin seguro"},{"$f":"INDIRECT(\"'Dictionary'!R\"&MATCH(\"Interest\",Dictionary!A:A,0)&\"C\"&LangCol,FALSE)","v":"Intereses"},{"$f":"INDIRECT(\"'Dictionary'!R\"&MATCH(\"Insurance\",Dictionary!A:A,0)&\"C\"&LangCol,FALSE)","v":"Seguro"},{"$f":"INDIRECT(\"'Dictionary'!R\"&MATCH(\"Principal\",Dictionary!A:A,0)&\"C\"&LangCol,FALSE)","v":"Capital pagado"},{"$f":"INDIRECT(\"'Dictionary'!R\"&MATCH(\"Balance\",Dictionary!A:A,0)&\"C\"&LangCol,FALSE)","v":"Capital restante"},{"$f":"INDIRECT(\"'Dictionary'!R\"&MATCH(\"Total Interest\t\",Dictionary!A:A,0)&\"C\"&LangCol,FALSE)","v":"Interés acumulado"}]
[null,{"$f":"IF(AND(D30<>\"\",OR(typediffere=2,typediffere=3),B29<dureediffere),\"D\",D30)","v":1},{"$f":"IF(D30<>\"\",DATE(F4,COUNTIF(monthEnglish,\"January\")*1+COUNTIF(monthEnglish,\"February\")*2+COUNTIF(monthEnglish,\"March\")*3+COUNTIF(monthEnglish,\"April\")*4+COUNTIF(monthEnglish,\"May\")*5+COUNTIF(monthEnglish,\"June\")*6+COUNTIF(monthEnglish,\"July\")*7+COUNTIF(monthEnglish,\"August\")*8+COUNTIF(monthEnglish,\"September\")*9+COUNTIF(monthEnglish,\"October\")*10+COUNTIF(monthEnglish,\"November\")*11+COUNTIF(monthEnglish,\"December\")*12,1),\"\")","v":"2020-08-01"},{"$f":"IF(AND(test=\"OK\",test2=\"OK\"),1,\"\")","v":1},{"$f":"IF(D30<>\"\",F30+H30,\"\")","v":5895.1824131577205},{"$f":"IF(AND(D30<>\"\",B30=D30,typediffere=1),(pret*tauxinteret/100)/(12*(1-POWER(1+((tauxinteret/100)/12),-dureepret))),IF(AND(D30<>\"\",B30=D30,typediffere=2),(pret*tauxinteret/100)/(12*(1-POWER(1+((tauxinteret/100)/12),-dureepret+dureediffere))),IF(AND(D30<>\"\",B30=\"D\",typediffere=2),G30,IF(AND(D30<>\"\",B30=\"D\",typediffere=3),0,IF(AND(D30<>\"\",B30=D30,B29=\"D\",typediffere=3),(pret*tauxinteret/100)/(12*(1-POWER(1+((tauxinteret/100)/12),-dureepret+dureediffere))),IF(AND(D30<>\"\",B30=D30,B29<>\"D\",typediffere=3),0,\"\"))))))","v":5728.5157464910535},{"$f":"IF(D30<>\"\",pret*tauxinteret/100/12,\"\")","v":333.33333333333331},{"$f":"IF(D30<>\"\",pret*tauxassurance/100/12,\"\")","v":166.66666666666666},{"$f":"IF(AND(D30<>\"\",B30=D30),F30-G30,IF(AND(D30<>\"\",B30=\"D\"),0,\"\"))","v":5395.1824131577205},{"$f":"IF(OR(AND(D30<>\"\",B30=D30),AND(D30<>\"\",B30=\"D\",typediffere=2)),pret-F30+G30,IF(AND(D30<>\"\",B30=\"D\",typediffere=3),pret+G30,\"\"))","v":194604.81758684228},{"$f":"IF(D30<>\"\",G30,\"\")","v":333.33333333333331}]
{"$rows_left_out":971}
{"sheet":"Dictionary","index":2,"n_rows":43,"n_cols":7,"rows_kept":43,"cut":false,"hidden":false,"merged":[]}
["Dictionary English","English","Francais","Deutsch","Italiano","Espanol","Portugues"]
["Mortgage calculator","Mortgage calculator","Tableau d'amortissement","Amortisationstabelle","Tabella di ammortamento","Tabla de amortización","Simulador de crédito"]
["Mortgage data","Mortgage data","Données concernant le prêt","Kreditdaten","Dati di prestito","Datos de prestamo","Dados do empréstimo"]
["Start date","Start date","Date de début","Startdatum","Data di inizio","Fecha de inicio","Data de início"]
["Mortgage amount","Mortgage amount","Montant du prêt","Darlehensbetrag","Importo del prestito","Importe del préstamo","Montante do empréstimo"]
["Mortgage term","Mortgage term","Durée","Dauer","Durata","Duración","Prazo"]
["Interest rate per year","Interest rate per year","Taux d'intérêt","Zinssatz","Tasso di interesse","Tasa de interés","Taxa de juros"]
["Insurance rate","Insurance rate","Taux d'assurance","Versicherungspreis","Tasso di assicurazione","Tasa de seguro","Taux d'assurance"]
["% of borrowed amount","% of borrowed amount","% du montant emprunté","% des geliehenen Betrags","% dell'importo preso in prestito","% de la cantidad prestada","% do montante emprestado"]
["Deferred repayment","Deferred repayment","Différé de remboursement","Zurückgestellte Abschreibung","Rimborso differito","Pago diferido","Reembolso diferido"]
["Type","Type","Type de différé","Zurückgestellte Abschreibung","Tipo di differito","Tipo diferido","Tipo de diferido"]
["Duration","Duration","Durée du différé","Dauer","Durata","Duración del diferido","Duração"]
["Without delay","Without delay","Sans Différé","Ohne","Senza","Sin","Sem"]
["Partial (with interest payment)","Partial (with interest payment)","Différé Partiel (avec paiement des intérêts)","Teilweise (mit Zinszahlung)","Partiele (con pagamento degli interessi)","Parcial (con pago de intereses)","Partial (com pagamento de juros)"]
["Total (without interest payment)","Total (without interest payment)","Différé Total (sans paiement des intérêts)","Gesamt (ohne Zinszahlung)","Totale (senza pagamento di interessi)","Total (sin pago de intereses)","Total (sem pagamento de juros)"]
["months","months","mois","Monat(e)","mese","mes","mês"]
["Mortgage cost","Mortgage cost","Coût global du prêt","Gesamtkosten des Darlehens","Costo complessivo del prestito","Costo total del préstamo","Coût global du prêt"]
["Total Interest","Total Interest","Coût des intérêts","Kosten von Interesse","Costo di interesse","Costo de interés","Custo de juros"]
["Total insurance","Total insurance","Coût de l'assurance","Versicherungskosten","Costo dell'assicurazione","Costo del seguro","Custos de seguro"]
["Total cost","Total cost","Coût total du prêt","Gesamtkosten des Darlehens","Costo totale del prestito","Costo total del préstamo","Custo total do empréstimo"]
["£","£","€","€","€","€","€"]
["Amortization schedule calculator","Amortization schedule calculator","Tableau d'amortissement","Amortisationstabelle","Tabella di ammortamento","Tabla de amortización","Simulador de crédito"]
["Date","Date","Date","Datum","Data","Fecha","Data"]
["No.","No.","No. d'échéance","Fälligkeitsnummer","N. pagamento","Cantidad de pagos","Mês"]
["Monthly payment with insurance","Monthly payment with insurance","Mensualité avec assurance","Monatlich mit Versicherung","Mensile con assicurazione","Pago mensual con seguro","Pagamento mensal com seguro"]
["Monthly payment without insurance","Monthly payment without insurance","Mensualité hors assurance","Monatlich Versicherung ausgeschlossen","Mensile esclusa l'assicurazione","Pago mensual sin seguro","Pagamento mensal excluindo seguro"]
["Interest","Interest","Intérêts","Zinsen","Interessi","Intereses","Juros"]
["Insurance","Insurance","Assurance","Versicherung","Assicurazione","Seguro","Seguro"]
["Principal","Principal","Capital remboursé","Kapital zurückerstattet","Capitale rimborsato","Capital pagado","Capital peembolsado"]
["Balance","Balance","Capital restant dû","Kapital fällig bleiben","Capitale rimanente","Capital restante","Capital restante"]
{"$rows_left_out":14}
{"sheet":"Month mapping","index":3,"n_rows":12,"n_cols":2,"rows_kept":12,"cut":false,"hidden":true,"merged":[]}
[1,"Jan"]
[2,"Feb"]
[3,"Mar"]
[4,"Apr"]
[5,"May"]
[6,"Jun"]
[7,"Jul"]
[8,"Aug"]
[9,"Sep"]
[10,"Oct"]
[11,"Nov"]
[12,"Dec"]