{"text_format":"1","workbook":"xlsx","n_sheets":4,"sheets":["Import model","Calculator","Dictionary","Month mapping"],"not_rendered":{"charts":0,"images":0,"macros":1,"external_links":0,"defined_names":26,"comments":0,"pivot_tables":0},"unopened":[],"bounds":{"document_bytes":16777216,"sheet_cells":100000,"rows_first":2000,"rows_last":500,"rows_between":2000,"halvings":0,"cell_chars":16384,"cell_head_chars":4096},"cells_cut":0,"cells_raw":0,"read":"whole","date_system":"1900"}

{"sheet":"Import model","index":0,"n_rows":799,"n_cols":8,"rows_kept":799,"cut":false,"hidden":false,"merged":[]}
["Year","Month","N°","Monthly payment","Interest","Insurance","Principal / Month","Balance"]
[{"$f":"IFERROR(YEAR(Calculator!C30),\"\")","v":2020},{"$f":"IFERROR(VLOOKUP(MONTH(Calculator!C30),'Month mapping'!A:B,2,0),\"\")","v":"Aug"},{"$f":"Calculator!D30","v":1},{"$f":"Calculator!E30","v":5895.1824131577205},{"$f":"Calculator!G30","v":333.33333333333331},{"$f":"Calculator!H30","v":166.66666666666666},{"$f":"Calculator!I30","v":5395.1824131577205},{"$f":"Calculator!J30","v":194604.81758684228}]
[{"$f":"IFERROR(YEAR(Calculator!C31),\"\")","v":2020},{"$f":"IFERROR(VLOOKUP(MONTH(Calculator!C31),'Month mapping'!A:B,2,0),\"\")","v":"Sep"},{"$f":"Calculator!D31","v":2},{"$f":"Calculator!E31","v":5895.1824131577205},{"$f":"Calculator!G31","v":324.3413626447371},{"$f":"Calculator!H31","v":166.66666666666666},{"$f":"Calculator!I31","v":5404.1743838463162},{"$f":"Calculator!J31","v":189200.64320299597}]
[{"$f":"IFERROR(YEAR(Calculator!C32),\"\")","v":2020},{"$f":"IFERROR(VLOOKUP(MONTH(Calculator!C32),'Month mapping'!A:B,2,0),\"\")","v":"Oct"},{"$f":"Calculator!D32","v":3},{"$f":"Calculator!E32","v":5895.1824131577205},{"$f":"Calculator!G32","v":315.33440533832663},{"$f":"Calculator!H32","v":166.66666666666666},{"$f":"Calculator!I32","v":5413.1813411527273},{"$f":"Calculator!J32","v":183787.46186184324}]
[{"$f":"IFERROR(YEAR(Calculator!C33),\"\")","v":2020},{"$f":"IFERROR(VLOOKUP(MONTH(Calculator!C33),'Month mapping'!A:B,2,0),\"\")","v":"Nov"},{"$f":"Calculator!D33","v":4},{"$f":"Calculator!E33","v":5895.1824131577205},{"$f":"Calculator!G33","v":306.31243643640539},{"$f":"Calculator!H33","v":166.66666666666666},{"$f":"Calculator!I33","v":5422.2033100546478},{"$f":"Calculator!J33","v":178365.2585517886}]
[{"$f":"IFERROR(YEAR(Calculator!C34),\"\")","v":2020},{"$f":"IFERROR(VLOOKUP(MONTH(Calculator!C34),'Month mapping'!A:B,2,0),\"\")","v":"Dec"},{"$f":"Calculator!D34","v":5},{"$f":"Calculator!E34","v":5895.1824131577205},{"$f":"Calculator!G34","v":297.2754309196477},{"$f":"Calculator!H34","v":166.66666666666666},{"$f":"Calculator!I34","v":5431.2403155714055},{"$f":"Calculator!J34","v":172934.01823621721}]
[{"$f":"IFERROR(YEAR(Calculator!C35),\"\")","v":2021},{"$f":"IFERROR(VLOOKUP(MONTH(Calculator!C35),'Month mapping'!A:B,2,0),\"\")","v":"Jan"},{"$f":"Calculator!D35","v":6},{"$f":"Calculator!E35","v":5895.1824131577205},{"$f":"Calculator!G35","v":288.2233637270287},{"$f":"Calculator!H35","v":166.66666666666666},{"$f":"Calculator!I35","v":5440.2923827640252},{"$f":"Calculator!J35","v":167493.72585345319}]
[{"$f":"IFERROR(YEAR(Calculator!C36),\"\")","v":2021},{"$f":"IFERROR(VLOOKUP(MONTH(Calculator!C36),'Month mapping'!A:B,2,0),\"\")","v":"Feb"},{"$f":"Calculator!D36","v":7},{"$f":"Calculator!E36","v":5895.1824131577205},{"$f":"Calculator!G36","v":279.1562097557553},{"$f":"Calculator!H36","v":166.66666666666666},{"$f":"Calculator!I36","v":5449.3595367352982},{"$f":"Calculator!J36","v":162044.36631671787}]
[{"$f":"IFERROR(YEAR(Calculator!C37),\"\")","v":2021},{"$f":"IFERROR(VLOOKUP(MONTH(Calculator!C37),'Month mapping'!A:B,2,0),\"\")","v":"Mar"},{"$f":"Calculator!D37","v":8},{"$f":"Calculator!E37","v":5895.1824131577205},{"$f":"Calculator!G37","v":270.07394386119648},{"$f":"Calculator!H37","v":166.66666666666666},{"$f":"Calculator!I37","v":5458.4418026298572},{"$f":"Calculator!J37","v":156585.92451408802}]
[{"$f":"IFERROR(YEAR(Calculator!C38),\"\")","v":2021},{"$f":"IFERROR(VLOOKUP(MONTH(Calculator!C38),'Month mapping'!A:B,2,0),\"\")","v":"Apr"},{"$f":"Calculator!D38","v":9},{"$f":"Calculator!E38","v":5895.1824131577205},{"$f":"Calculator!G38","v":260.97654085681336},{"$f":"Calculator!H38","v":166.66666666666666},{"$f":"Calculator!I38","v":5467.5392056342398},{"$f":"Calculator!J38","v":151118.38530845378}]
[{"$f":"IFERROR(YEAR(Calculator!C39),\"\")","v":2021},{"$f":"IFERROR(VLOOKUP(MONTH(Calculator!C39),'Month mapping'!A:B,2,0),\"\")","v":"May"},{"$f":"Calculator!D39","v":10},{"$f":"Calculator!E39","v":5895.1824131577205},{"$f":"Calculator!G39","v":251.86397551408962},{"$f":"Calculator!H39","v":166.66666666666666},{"$f":"Calculator!I39","v":5476.6517709769641},{"$f":"Calculator!J39","v":145641.7335374768}]
[{"$f":"IFERROR(YEAR(Calculator!C40),\"\")","v":2021},{"$f":"IFERROR(VLOOKUP(MONTH(Calculator!C40),'Month mapping'!A:B,2,0),\"\")","v":"Jun"},{"$f":"Calculator!D40","v":11},{"$f":"Calculator!E40","v":5895.1824131577205},{"$f":"Calculator!G40","v":242.73622256246134},{"$f":"Calculator!H40","v":166.66666666666666},{"$f":"Calculator!I40","v":5485.7795239285924},{"$f":"Calculator!J40","v":140155.95401354821}]
[{"$f":"IFERROR(YEAR(Calculator!C41),\"\")","v":2021},{"$f":"IFERROR(VLOOKUP(MONTH(Calculator!C41),'Month mapping'!A:B,2,0),\"\")","v":"Jul"},{"$f":"Calculator!D41","v":12},{"$f":"Calculator!E41","v":5895.1824131577205},{"$f":"Calculator!G41","v":233.59325668924703},{"$f":"Calculator!H41","v":166.66666666666666},{"$f":"Calculator!I41","v":5494.9224898018065},{"$f":"Calculator!J41","v":134661.03152374641}]
[{"$f":"IFERROR(YEAR(Calculator!C42),\"\")","v":2021},{"$f":"IFERROR(VLOOKUP(MONTH(Calculator!C42),'Month mapping'!A:B,2,0),\"\")","v":"Aug"},{"$f":"Calculator!D42","v":13},{"$f":"Calculator!E42","v":5895.1824131577205},{"$f":"Calculator!G42","v":224.43505253957736},{"$f":"Calculator!H42","v":166.66666666666666},{"$f":"Calculator!I42","v":5504.080693951476},{"$f":"Calculator!J42","v":129156.95082979492}]
[{"$f":"IFERROR(YEAR(Calculator!C43),\"\")","v":2021},{"$f":"IFERROR(VLOOKUP(MONTH(Calculator!C43),'Month mapping'!A:B,2,0),\"\")","v":"Sep"},{"$f":"Calculator!D43","v":14},{"$f":"Calculator!E43","v":5895.1824131577205},{"$f":"Calculator!G43","v":215.26158471632485},{"$f":"Calculator!H43","v":166.66666666666666},{"$f":"Calculator!I43","v":5513.2541617747283},{"$f":"Calculator!J43","v":123643.69666802019}]
[{"$f":"IFERROR(YEAR(Calculator!C44),\"\")","v":2021},{"$f":"IFERROR(VLOOKUP(MONTH(Calculator!C44),'Month mapping'!A:B,2,0),\"\")","v":"Oct"},{"$f":"Calculator!D44","v":15},{"$f":"Calculator!E44","v":5895.1824131577205},{"$f":"Calculator!G44","v":206.07282778003366},{"$f":"Calculator!H44","v":166.66666666666666},{"$f":"Calculator!I44","v":5522.44291871102},{"$f":"Calculator!J44","v":118121.25374930917}]
[{"$f":"IFERROR(YEAR(Calculator!C45),\"\")","v":2021},{"$f":"IFERROR(VLOOKUP(MONTH(Calculator!C45),'Month mapping'!A:B,2,0),\"\")","v":"Nov"},{"$f":"Calculator!D45","v":16},{"$f":"Calculator!E45","v":5895.1824131577205},{"$f":"Calculator!G45","v":196.86875624884863},{"$f":"Calculator!H45","v":166.66666666666666},{"$f":"Calculator!I45","v":5531.646990242205},{"$f":"Calculator!J45","v":112589.60675906696}]
[{"$f":"IFERROR(YEAR(Calculator!C46),\"\")","v":2021},{"$f":"IFERROR(VLOOKUP(MONTH(Calculator!C46),'Month mapping'!A:B,2,0),\"\")","v":"Dec"},{"$f":"Calculator!D46","v":17},{"$f":"Calculator!E46","v":5895.1824131577205},{"$f":"Calculator!G46","v":187.64934459844494},{"$f":"Calculator!H46","v":166.66666666666666},{"$f":"Calculator!I46","v":5540.8664018926083},{"$f":"Calculator!J46","v":107048.74035717433}]
[{"$f":"IFERROR(YEAR(Calculator!C47),\"\")","v":2022},{"$f":"IFERROR(VLOOKUP(MONTH(Calculator!C47),'Month mapping'!A:B,2,0),\"\")","v":"Jan"},{"$f":"Calculator!D47","v":18},{"$f":"Calculator!E47","v":5895.1824131577205},{"$f":"Calculator!G47","v":178.41456726195722},{"$f":"Calculator!H47","v":166.66666666666666},{"$f":"Calculator!I47","v":5550.1011792290965},{"$f":"Calculator!J47","v":101498.63917794524}]
[{"$f":"IFERROR(YEAR(Calculator!C48),\"\")","v":2022},{"$f":"IFERROR(VLOOKUP(MONTH(Calculator!C48),'Month mapping'!A:B,2,0),\"\")","v":"Feb"},{"$f":"Calculator!D48","v":19},{"$f":"Calculator!E48","v":5895.1824131577205},{"$f":"Calculator!G48","v":169.16439862990873},{"$f":"Calculator!H48","v":166.66666666666666},{"$f":"Calculator!I48","v":5559.3513478611449},{"$f":"Calculator!J48","v":95939.287830084082}]
[{"$f":"IFERROR(YEAR(Calculator!C49),\"\")","v":2022},{"$f":"IFERROR(VLOOKUP(MONTH(Calculator!C49),'Month mapping'!A:B,2,0),\"\")","v":"Mar"},{"$f":"Calculator!D49","v":20},{"$f":"Calculator!E49","v":5895.1824131577205},{"$f":"Calculator!G49","v":159.89881305014015},{"$f":"Calculator!H49","v":166.66666666666666},{"$f":"Calculator!I49","v":5568.6169334409133},{"$f":"Calculator!J49","v":90370.670896643162}]
[{"$f":"IFERROR(YEAR(Calculator!C50),\"\")","v":2022},{"$f":"IFERROR(VLOOKUP(MONTH(Calculator!C50),'Month mapping'!A:B,2,0),\"\")","v":"Apr"},{"$f":"Calculator!D50","v":21},{"$f":"Calculator!E50","v":5895.1824131577205},{"$f":"Calculator!G50","v":150.6177848277386},{"$f":"Calculator!H50","v":166.66666666666666},{"$f":"Calculator!I50","v":5577.8979616633151},{"$f":"Calculator!J50","v":84792.772934979846}]
[{"$f":"IFERROR(YEAR(Calculator!C51),\"\")","v":2022},{"$f":"IFERROR(VLOOKUP(MONTH(Calculator!C51),'Month mapping'!A:B,2,0),\"\")","v":"May"},{"$f":"Calculator!D51","v":22},{"$f":"Calculator!E51","v":5895.1824131577205},{"$f":"Calculator!G51","v":141.32128822496642},{"$f":"Calculator!H51","v":166.66666666666666},{"$f":"Calculator!I51","v":5587.1944582660872},{"$f":"Calculator!J51","v":79205.578476713752}]
[{"$f":"IFERROR(YEAR(Calculator!C52),\"\")","v":2022},{"$f":"IFERROR(VLOOKUP(MONTH(Calculator!C52),'Month mapping'!A:B,2,0),\"\")","v":"Jun"},{"$f":"Calculator!D52","v":23},{"$f":"Calculator!E52","v":5895.1824131577205},{"$f":"Calculator!G52","v":132.00929746118959},{"$f":"Calculator!H52","v":166.66666666666666},{"$f":"Calculator!I52","v":5596.5064490298637},{"$f":"Calculator!J52","v":73609.072027683884}]
[{"$f":"IFERROR(YEAR(Calculator!C53),\"\")","v":2022},{"$f":"IFERROR(VLOOKUP(MONTH(Calculator!C53),'Month mapping'!A:B,2,0),\"\")","v":"Jul"},{"$f":"Calculator!D53","v":24},{"$f":"Calculator!E53","v":5895.1824131577205},{"$f":"Calculator!G53","v":122.68178671280647},{"$f":"Calculator!H53","v":166.66666666666666},{"$f":"Calculator!I53","v":5605.8339597782469},{"$f":"Calculator!J53","v":68003.238067905637}]
[{"$f":"IFERROR(YEAR(Calculator!C54),\"\")","v":2022},{"$f":"IFERROR(VLOOKUP(MONTH(Calculator!C54),'Month mapping'!A:B,2,0),\"\")","v":"Aug"},{"$f":"Calculator!D54","v":25},{"$f":"Calculator!E54","v":5895.1824131577205},{"$f":"Calculator!G54","v":113.33873011317606},{"$f":"Calculator!H54","v":166.66666666666666},{"$f":"Calculator!I54","v":5615.1770163778774},{"$f":"Calculator!J54","v":62388.061051527759}]
[{"$f":"IFERROR(YEAR(Calculator!C55),\"\")","v":2022},{"$f":"IFERROR(VLOOKUP(MONTH(Calculator!C55),'Month mapping'!A:B,2,0),\"\")","v":"Sep"},{"$f":"Calculator!D55","v":26},{"$f":"Calculator!E55","v":5895.1824131577205},{"$f":"Calculator!G55","v":103.98010175254626},{"$f":"Calculator!H55","v":166.66666666666666},{"$f":"Calculator!I55","v":5624.5356447385075},{"$f":"Calculator!J55","v":56763.525406789253}]
[{"$f":"IFERROR(YEAR(Calculator!C56),\"\")","v":2022},{"$f":"IFERROR(VLOOKUP(MONTH(Calculator!C56),'Month mapping'!A:B,2,0),\"\")","v":"Oct"},{"$f":"Calculator!D56","v":27},{"$f":"Calculator!E56","v":5895.1824131577205},{"$f":"Calculator!G56","v":94.605875677982098},{"$f":"Calculator!H56","v":166.66666666666666},{"$f":"Calculator!I56","v":5633.9098708130714},{"$f":"Calculator!J56","v":51129.615535976183}]
[{"$f":"IFERROR(YEAR(Calculator!C57),\"\")","v":2022},{"$f":"IFERROR(VLOOKUP(MONTH(Calculator!C57),'Month mapping'!A:B,2,0),\"\")","v":"Nov"},{"$f":"Calculator!D57","v":28},{"$f":"Calculator!E57","v":5895.1824131577205},{"$f":"Calculator!G57","v":85.216025893293633},{"$f":"Calculator!H57","v":166.66666666666666},{"$f":"Calculator!I57","v":5643.2997205977599},{"$f":"Calculator!J57","v":45486.315815378424}]
[{"$f":"IFERROR(YEAR(Calculator!C58),\"\")","v":2022},{"$f":"IFERROR(VLOOKUP(MONTH(Calculator!C58),'Month mapping'!A:B,2,0),\"\")","v":"Dec"},{"$f":"Calculator!D58","v":29},{"$f":"Calculator!E58","v":5895.1824131577205},{"$f":"Calculator!G58","v":75.81052635896404},{"$f":"Calculator!H58","v":166.66666666666666},{"$f":"Calculator!I58","v":5652.7052201320894},{"$f":"Calculator!J58","v":39833.610595246333}]
[{"$f":"IFERROR(YEAR(Calculator!C59),\"\")","v":2023},{"$f":"IFERROR(VLOOKUP(MONTH(Calculator!C59),'Month mapping'!A:B,2,0),\"\")","v":"Jan"},{"$f":"Calculator!D59","v":30},{"$f":"Calculator!E59","v":5895.1824131577205},{"$f":"Calculator!G59","v":66.389350992077226},{"$f":"Calculator!H59","v":166.66666666666666},{"$f":"Calculator!I59","v":5662.1263954989763},{"$f":"Calculator!J59","v":34171.484199747356}]
[{"$f":"IFERROR(YEAR(Calculator!C60),\"\")","v":2023},{"$f":"IFERROR(VLOOKUP(MONTH(Calculator!C60),'Month mapping'!A:B,2,0),\"\")","v":"Feb"},{"$f":"Calculator!D60","v":31},{"$f":"Calculator!E60","v":5895.1824131577205},{"$f":"Calculator!G60","v":56.952473666245595},{"$f":"Calculator!H60","v":166.66666666666666},{"$f":"Calculator!I60","v":5671.5632728248083},{"$f":"Calculator!J60","v":28499.92092692255}]
[{"$f":"IFERROR(YEAR(Calculator!C61),\"\")","v":2023},{"$f":"IFERROR(VLOOKUP(MONTH(Calculator!C61),'Month mapping'!A:B,2,0),\"\")","v":"Mar"},{"$f":"Calculator!D61","v":32},{"$f":"Calculator!E61","v":5895.1824131577205},{"$f":"Calculator!G61","v":47.499868211537581},{"$f":"Calculator!H61","v":166.66666666666666},{"$f":"Calculator!I61","v":5681.0158782795161},{"$f":"Calculator!J61","v":22818.905048643031}]
[{"$f":"IFERROR(YEAR(Calculator!C62),\"\")","v":2023},{"$f":"IFERROR(VLOOKUP(MONTH(Calculator!C62),'Month mapping'!A:B,2,0),\"\")","v":"Apr"},{"$f":"Calculator!D62","v":33},{"$f":"Calculator!E62","v":5895.1824131577205},{"$f":"Calculator!G62","v":38.031508414405053},{"$f":"Calculator!H62","v":166.66666666666666},{"$f":"Calculator!I62","v":5690.4842380766486},{"$f":"Calculator!J62","v":17128.420810566382}]
[{"$f":"IFERROR(YEAR(Calculator!C63),\"\")","v":2023},{"$f":"IFERROR(VLOOKUP(MONTH(Calculator!C63),'Month mapping'!A:B,2,0),\"\")","v":"May"},{"$f":"Calculator!D63","v":34},{"$f":"Calculator!E63","v":5895.1824131577205},{"$f":"Calculator!G63","v":28.547368017610637},{"$f":"Calculator!H63","v":166.66666666666666},{"$f":"Calculator!I63","v":5699.9683784734425},{"$f":"Calculator!J63","v":11428.452432092939}]
[{"$f":"IFERROR(YEAR(Calculator!C64),\"\")","v":2023},{"$f":"IFERROR(VLOOKUP(MONTH(Calculator!C64),'Month mapping'!A:B,2,0),\"\")","v":"Jun"},{"$f":"Calculator!D64","v":35},{"$f":"Calculator!E64","v":5895.1824131577205},{"$f":"Calculator!G64","v":19.0474207201549},{"$f":"Calculator!H64","v":166.66666666666666},{"$f":"Calculator!I64","v":5709.4683257708984},{"$f":"Calculator!J64","v":5718.984106322041}]
[{"$f":"IFERROR(YEAR(Calculator!C65),\"\")","v":2023},{"$f":"IFERROR(VLOOKUP(MONTH(Calculator!C65),'Month mapping'!A:B,2,0),\"\")","v":"Jul"},{"$f":"Calculator!D65","v":36},{"$f":"Calculator!E65","v":5895.1824131577205},{"$f":"Calculator!G65","v":9.5316401772034016},{"$f":"Calculator!H65","v":166.66666666666666},{"$f":"Calculator!I65","v":5718.9841063138501},{"$f":"Calculator!J65","v":8.1909394822332615E-9}]
[{"$f":"IFERROR(YEAR(Calculator!C66),\"\")","v":""},{"$f":"IFERROR(VLOOKUP(MONTH(Calculator!C66),'Month mapping'!A:B,2,0),\"\")","v":""},{"$f":"Calculator!D66","v":""},{"$f":"Calculator!E66","v":""},{"$f":"Calculator!G66","v":""},{"$f":"Calculator!H66","v":""},{"$f":"Calculator!I66","v":""},{"$f":"Calculator!J66","v":""}]
[{"$f":"IFERROR(YEAR(Calculator!C67),\"\")","v":""},{"$f":"IFERROR(VLOOKUP(MONTH(Calculator!C67),'Month mapping'!A:B,2,0),\"\")","v":""},{"$f":"Calculator!D67","v":""},{"$f":"Calculator!E67","v":""},{"$f":"Calculator!G67","v":""},{"$f":"Calculator!H67","v":""},{"$f":"Calculator!I67","v":""},{"$f":"Calculator!J67","v":""}]
[{"$f":"IFERROR(YEAR(Calculator!C68),\"\")","v":""},{"$f":"IFERROR(VLOOKUP(MONTH(Calculator!C68),'Month mapping'!A:B,2,0),\"\")","v":""},{"$f":"Calculator!D68","v":""},{"$f":"Calculator!E68","v":""},{"$f":"Calculator!G68","v":""},{"$f":"Calculator!H68","v":""},{"$f":"Calculator!I68","v":""},{"$f":"Calculator!J68","v":""}]
[{"$f":"IFERROR(YEAR(Calculator!C69),\"\")","v":""},{"$f":"IFERROR(VLOOKUP(MONTH(Calculator!C69),'Month mapping'!A:B,2,0),\"\")","v":""},{"$f":"Calculator!D69","v":""},{"$f":"Calculator!E69","v":""},{"$f":"Calculator!G69","v":""},{"$f":"Calculator!H69","v":""},{"$f":"Calculator!I69","v":""},{"$f":"Calculator!J69","v":""}]
[{"$f":"IFERROR(YEAR(Calculator!C70),\"\")","v":""},{"$f":"IFERROR(VLOOKUP(MONTH(Calculator!C70),'Month mapping'!A:B,2,0),\"\")","v":""},{"$f":"Calculator!D70","v":""},{"$f":"Calculator!E70","v":""},{"$f":"Calculator!G70","v":""},{"$f":"Calculator!H70","v":""},{"$f":"Calculator!I70","v":""},{"$f":"Calculator!J70","v":""}]
[{"$f":"IFERROR(YEAR(Calculator!C71),\"\")","v":""},{"$f":"IFERROR(VLOOKUP(MONTH(Calculator!C71),'Month mapping'!A:B,2,0),\"\")","v":""},{"$f":"Calculator!D71","v":""},{"$f":"Calculator!E71","v":""},{"$f":"Calculator!G71","v":""},{"$f":"Calculator!H71","v":""},{"$f":"Calculator!I71","v":""},{"$f":"Calculator!J71","v":""}]
[{"$f":"IFERROR(YEAR(Calculator!C72),\"\")","v":""},{"$f":"IFERROR(VLOOKUP(MONTH(Calculator!C72),'Month mapping'!A:B,2,0),\"\")","v":""},{"$f":"Calculator!D72","v":""},{"$f":"Calculator!E72","v":""},{"$f":"Calculator!G72","v":""},{"$f":"Calculator!H72","v":""},{"$f":"Calculator!I72","v":""},{"$f":"Calculator!J72","v":""}]
[{"$f":"IFERROR(YEAR(Calculator!C73),\"\")","v":""},{"$f":"IFERROR(VLOOKUP(MONTH(Calculator!C73),'Month mapping'!A:B,2,0),\"\")","v":""},{"$f":"Calculator!D73","v":""},{"$f":"Calculator!E73","v":""},{"$f":"Calculator!G73","v":""},{"$f":"Calculator!H73","v":""},{"$f":"Calculator!I73","v":""},{"$f":"Calculator!J73","v":""}]
[{"$f":"IFERROR(YEAR(Calculator!C74),\"\")","v":""},{"$f":"IFERROR(VLOOKUP(MONTH(Calculator!C74),'Month mapping'!A:B,2,0),\"\")","v":""},{"$f":"Calculator!D74","v":""},{"$f":"Calculator!E74","v":""},{"$f":"Calculator!G74","v":""},{"$f":"Calculator!H74","v":""},{"$f":"Calculator!I74","v":""},{"$f":"Calculator!J74","v":""}]
[{"$f":"IFERROR(YEAR(Calculator!C75),\"\")","v":""},{"$f":"IFERROR(VLOOKUP(MONTH(Calculator!C75),'Month mapping'!A:B,2,0),\"\")","v":""},{"$f":"Calculator!D75","v":""},{"$f":"Calculator!E75","v":""},{"$f":"Calculator!G75","v":""},{"$f":"Calculator!H75","v":""},{"$f":"Calculator!I75","v":""},{"$f":"Calculator!J75","v":""}]
[{"$f":"IFERROR(YEAR(Calculator!C76),\"\")","v":""},{"$f":"IFERROR(VLOOKUP(MONTH(Calculator!C76),'Month mapping'!A:B,2,0),\"\")","v":""},{"$f":"Calculator!D76","v":""},{"$f":"Calculator!E76","v":""},{"$f":"Calculator!G76","v":""},{"$f":"Calculator!H76","v":""},{"$f":"Calculator!I76","v":""},{"$f":"Calculator!J76","v":""}]
[{"$f":"IFERROR(YEAR(Calculator!C77),\"\")","v":""},{"$f":"IFERROR(VLOOKUP(MONTH(Calculator!C77),'Month mapping'!A:B,2,0),\"\")","v":""},{"$f":"Calculator!D77","v":""},{"$f":"Calculator!E77","v":""},{"$f":"Calculator!G77","v":""},{"$f":"Calculator!H77","v":""},{"$f":"Calculator!I77","v":""},{"$f":"Calculator!J77","v":""}]
[{"$f":"IFERROR(YEAR(Calculator!C78),\"\")","v":""},{"$f":"IFERROR(VLOOKUP(MONTH(Calculator!C78),'Month mapping'!A:B,2,0),\"\")","v":""},{"$f":"Calculator!D78","v":""},{"$f":"Calculator!E78","v":""},{"$f":"Calculator!G78","v":""},{"$f":"Calculator!H78","v":""},{"$f":"Calculator!I78","v":""},{"$f":"Calculator!J78","v":""}]
[{"$f":"IFERROR(YEAR(Calculator!C79),\"\")","v":""},{"$f":"IFERROR(VLOOKUP(MONTH(Calculator!C79),'Month mapping'!A:B,2,0),\"\")","v":""},{"$f":"Calculator!D79","v":""},{"$f":"Calculator!E79","v":""},{"$f":"Calculator!G79","v":""},{"$f":"Calculator!H79","v":""},{"$f":"Calculator!I79","v":""},{"$f":"Calculator!J79","v":""}]
[{"$f":"IFERROR(YEAR(Calculator!C80),\"\")","v":""},{"$f":"IFERROR(VLOOKUP(MONTH(Calculator!C80),'Month mapping'!A:B,2,0),\"\")","v":""},{"$f":"Calculator!D80","v":""},{"$f":"Calculator!E80","v":""},{"$f":"Calculator!G80","v":""},{"$f":"Calculator!H80","v":""},{"$f":"Calculator!I80","v":""},{"$f":"Calculator!J80","v":""}]
[{"$f":"IFERROR(YEAR(Calculator!C81),\"\")","v":""},{"$f":"IFERROR(VLOOKUP(MONTH(Calculator!C81),'Month mapping'!A:B,2,0),\"\")","v":""},{"$f":"Calculator!D81","v":""},{"$f":"Calculator!E81","v":""},{"$f":"Calculator!G81","v":""},{"$f":"Calculator!H81","v":""},{"$f":"Calculator!I81","v":""},{"$f":"Calculator!J81","v":""}]
[{"$f":"IFERROR(YEAR(Calculator!C82),\"\")","v":""},{"$f":"IFERROR(VLOOKUP(MONTH(Calculator!C82),'Month mapping'!A:B,2,0),\"\")","v":""},{"$f":"Calculator!D82","v":""},{"$f":"Calculator!E82","v":""},{"$f":"Calculator!G82","v":""},{"$f":"Calculator!H82","v":""},{"$f":"Calculator!I82","v":""},{"$f":"Calculator!J82","v":""}]
[{"$f":"IFERROR(YEAR(Calculator!C83),\"\")","v":""},{"$f":"IFERROR(VLOOKUP(MONTH(Calculator!C83),'Month mapping'!A:B,2,0),\"\")","v":""},{"$f":"Calculator!D83","v":""},{"$f":"Calculator!E83","v":""},{"$f":"Calculator!G83","v":""},{"$f":"Calculator!H83","v":""},{"$f":"Calculator!I83","v":""},{"$f":"Calculator!J83","v":""}]
[{"$f":"IFERROR(YEAR(Calculator!C84),\"\")","v":""},{"$f":"IFERROR(VLOOKUP(MONTH(Calculator!C84),'Month mapping'!A:B,2,0),\"\")","v":""},{"$f":"Calculator!D84","v":""},{"$f":"Calculator!E84","v":""},{"$f":"Calculator!G84","v":""},{"$f":"Calculator!H84","v":""},{"$f":"Calculator!I84","v":""},{"$f":"Calculator!J84","v":""}]
[{"$f":"IFERROR(YEAR(Calculator!C85),\"\")","v":""},{"$f":"IFERROR(VLOOKUP(MONTH(Calculator!C85),'Month mapping'!A:B,2,0),\"\")","v":""},{"$f":"Calculator!D85","v":""},{"$f":"Calculator!E85","v":""},{"$f":"Calculator!G85","v":""},{"$f":"Calculator!H85","v":""},{"$f":"Calculator!I85","v":""},{"$f":"Calculator!J85","v":""}]
[{"$f":"IFERROR(YEAR(Calculator!C86),\"\")","v":""},{"$f":"IFERROR(VLOOKUP(MONTH(Calculator!C86),'Month mapping'!A:B,2,0),\"\")","v":""},{"$f":"Calculator!D86","v":""},{"$f":"Calculator!E86","v":""},{"$f":"Calculator!G86","v":""},{"$f":"Calculator!H86","v":""},{"$f":"Calculator!I86","v":""},{"$f":"Calculator!J86","v":""}]
[{"$f":"IFERROR(YEAR(Calculator!C87),\"\")","v":""},{"$f":"IFERROR(VLOOKUP(MONTH(Calculator!C87),'Month mapping'!A:B,2,0),\"\")","v":""},{"$f":"Calculator!D87","v":""},{"$f":"Calculator!E87","v":""},{"$f":"Calculator!G87","v":""},{"$f":"Calculator!H87","v":""},{"$f":"Calculator!I87","v":""},{"$f":"Calculator!J87","v":""}]
[{"$f":"IFERROR(YEAR(Calculator!C88),\"\")","v":""},{"$f":"IFERROR(VLOOKUP(MONTH(Calculator!C88),'Month mapping'!A:B,2,0),\"\")","v":""},{"$f":"Calculator!D88","v":""},{"$f":"Calculator!E88","v":""},{"$f":"Calculator!G88","v":""},{"$f":"Calculator!H88","v":""},{"$f":"Calculator!I88","v":""},{"$f":"Calculator!J88","v":""}]
[{"$f":"IFERROR(YEAR(Calculator!C89),\"\")","v":""},{"$f":"IFERROR(VLOOKUP(MONTH(Calculator!C89),'Month mapping'!A:B,2,0),\"\")","v":""},{"$f":"Calculator!D89","v":""},{"$f":"Calculator!E89","v":""},{"$f":"Calculator!G89","v":""},{"$f":"Calculator!H89","v":""},{"$f":"Calculator!I89","v":""},{"$f":"Calculator!J89","v":""}]
[{"$f":"IFERROR(YEAR(Calculator!C90),\"\")","v":""},{"$f":"IFERROR(VLOOKUP(MONTH(Calculator!C90),'Month mapping'!A:B,2,0),\"\")","v":""},{"$f":"Calculator!D90","v":""},{"$f":"Calculator!E90","v":""},{"$f":"Calculator!G90","v":""},{"$f":"Calculator!H90","v":""},{"$f":"Calculator!I90","v":""},{"$f":"Calculator!J90","v":""}]
[{"$f":"IFERROR(YEAR(Calculator!C91),\"\")","v":""},{"$f":"IFERROR(VLOOKUP(MONTH(Calculator!C91),'Month mapping'!A:B,2,0),\"\")","v":""},{"$f":"Calculator!D91","v":""},{"$f":"Calculator!E91","v":""},{"$f":"Calculator!G91","v":""},{"$f":"Calculator!H91","v":""},{"$f":"Calculator!I91","v":""},{"$f":"Calculator!J91","v":""}]
[{"$f":"IFERROR(YEAR(Calculator!C92),\"\")","v":""},{"$f":"IFERROR(VLOOKUP(MONTH(Calculator!C92),'Month mapping'!A:B,2,0),\"\")","v":""},{"$f":"Calculator!D92","v":""},{"$f":"Calculator!E92","v":""},{"$f":"Calculator!G92","v":""},{"$f":"Calculator!H92","v":""},{"$f":"Calculator!I92","v":""},{"$f":"Calculator!J92","v":""}]
[{"$f":"IFERROR(YEAR(Calculator!C93),\"\")","v":""},{"$f":"IFERROR(VLOOKUP(MONTH(Calculator!C93),'Month mapping'!A:B,2,0),\"\")","v":""},{"$f":"Calculator!D93","v":""},{"$f":"Calculator!E93","v":""},{"$f":"Calculator!G93","v":""},{"$f":"Calculator!H93","v":""},{"$f":"Calculator!I93","v":""},{"$f":"Calculator!J93","v":""}]
[{"$f":"IFERROR(YEAR(Calculator!C94),\"\")","v":""},{"$f":"IFERROR(VLOOKUP(MONTH(Calculator!C94),'Month mapping'!A:B,2,0),\"\")","v":""},{"$f":"Calculator!D94","v":""},{"$f":"Calculator!E94","v":""},{"$f":"Calculator!G94","v":""},{"$f":"Calculator!H94","v":""},{"$f":"Calculator!I94","v":""},{"$f":"Calculator!J94","v":""}]
[{"$f":"IFERROR(YEAR(Calculator!C95),\"\")","v":""},{"$f":"IFERROR(VLOOKUP(MONTH(Calculator!C95),'Month mapping'!A:B,2,0),\"\")","v":""},{"$f":"Calculator!D95","v":""},{"$f":"Calculator!E95","v":""},{"$f":"Calculator!G95","v":""},{"$f":"Calculator!H95","v":""},{"$f":"Calculator!I95","v":""},{"$f":"Calculator!J95","v":""}]
[{"$f":"IFERROR(YEAR(Calculator!C96),\"\")","v":""},{"$f":"IFERROR(VLOOKUP(MONTH(Calculator!C96),'Month mapping'!A:B,2,0),\"\")","v":""},{"$f":"Calculator!D96","v":""},{"$f":"Calculator!E96","v":""},{"$f":"Calculator!G96","v":""},{"$f":"Calculator!H96","v":""},{"$f":"Calculator!I96","v":""},{"$f":"Calculator!J96","v":""}]
[{"$f":"IFERROR(YEAR(Calculator!C97),\"\")","v":""},{"$f":"IFERROR(VLOOKUP(MONTH(Calculator!C97),'Month mapping'!A:B,2,0),\"\")","v":""},{"$f":"Calculator!D97","v":""},{"$f":"Calculator!E97","v":""},{"$f":"Calculator!G97","v":""},{"$f":"Calculator!H97","v":""},{"$f":"Calculator!I97","v":""},{"$f":"Calculator!J97","v":""}]
[{"$f":"IFERROR(YEAR(Calculator!C98),\"\")","v":""},{"$f":"IFERROR(VLOOKUP(MONTH(Calculator!C98),'Month mapping'!A:B,2,0),\"\")","v":""},{"$f":"Calculator!D98","v":""},{"$f":"Calculator!E98","v":""},{"$f":"Calculator!G98","v":""},{"$f":"Calculator!H98","v":""},{"$f":"Calculator!I98","v":""},{"$f":"Calculator!J98","v":""}]
[{"$f":"IFERROR(YEAR(Calculator!C99),\"\")","v":""},{"$f":"IFERROR(VLOOKUP(MONTH(Calculator!C99),'Month mapping'!A:B,2,0),\"\")","v":""},{"$f":"Calculator!D99","v":""},{"$f":"Calculator!E99","v":""},{"$f":"Calculator!G99","v":""},{"$f":"Calculator!H99","v":""},{"$f":"Calculator!I99","v":""},{"$f":"Calculator!J99","v":""}]
[{"$f":"IFERROR(YEAR(Calculator!C100),\"\")","v":""},{"$f":"IFERROR(VLOOKUP(MONTH(Calculator!C100),'Month mapping'!A:B,2,0),\"\")","v":""},{"$f":"Calculator!D100","v":""},{"$f":"Calculator!E100","v":""},{"$f":"Calculator!G100","v":""},{"$f":"Calculator!H100","v":""},{"$f":"Calculator!I100","v":""},{"$f":"Calculator!J100","v":""}]
[{"$f":"IFERROR(YEAR(Calculator!C101),\"\")","v":""},{"$f":"IFERROR(VLOOKUP(MONTH(Calculator!C101),'Month mapping'!A:B,2,0),\"\")","v":""},{"$f":"Calculator!D101","v":""},{"$f":"Calculator!E101","v":""},{"$f":"Calculator!G101","v":""},{"$f":"Calculator!H101","v":""},{"$f":"Calculator!I101","v":""},{"$f":"Calculator!J101","v":""}]
[{"$f":"IFERROR(YEAR(Calculator!C102),\"\")","v":""},{"$f":"IFERROR(VLOOKUP(MONTH(Calculator!C102),'Month mapping'!A:B,2,0),\"\")","v":""},{"$f":"Calculator!D102","v":""},{"$f":"Calculator!E102","v":""},{"$f":"Calculator!G102","v":""},{"$f":"Calculator!H102","v":""},{"$f":"Calculator!I102","v":""},{"$f":"Calculator!J102","v":""}]
[{"$f":"IFERROR(YEAR(Calculator!C103),\"\")","v":""},{"$f":"IFERROR(VLOOKUP(MONTH(Calculator!C103),'Month mapping'!A:B,2,0),\"\")","v":""},{"$f":"Calculator!D103","v":""},{"$f":"Calculator!E103","v":""},{"$f":"Calculator!G103","v":""},{"$f":"Calculator!H103","v":""},{"$f":"Calculator!I103","v":""},{"$f":"Calculator!J103","v":""}]
[{"$f":"IFERROR(YEAR(Calculator!C104),\"\")","v":""},{"$f":"IFERROR(VLOOKUP(MONTH(Calculator!C104),'Month mapping'!A:B,2,0),\"\")","v":""},{"$f":"Calculator!D104","v":""},{"$f":"Calculator!E104","v":""},{"$f":"Calculator!G104","v":""},{"$f":"Calculator!H104","v":""},{"$f":"Calculator!I104","v":""},{"$f":"Calculator!J104","v":""}]
[{"$f":"IFERROR(YEAR(Calculator!C105),\"\")","v":""},{"$f":"IFERROR(VLOOKUP(MONTH(Calculator!C105),'Month mapping'!A:B,2,0),\"\")","v":""},{"$f":"Calculator!D105","v":""},{"$f":"Calculator!E105","v":""},{"$f":"Calculator!G105","v":""},{"$f":"Calculator!H105","v":""},{"$f":"Calculator!I105","v":""},{"$f":"Calculator!J105","v":""}]
[{"$f":"IFERROR(YEAR(Calculator!C106),\"\")","v":""},{"$f":"IFERROR(VLOOKUP(MONTH(Calculator!C106),'Month mapping'!A:B,2,0),\"\")","v":""},{"$f":"Calculator!D106","v":""},{"$f":"Calculator!E106","v":""},{"$f":"Calculator!G106","v":""},{"$f":"Calculator!H106","v":""},{"$f":"Calculator!I106","v":""},{"$f":"Calculator!J106","v":""}]
[{"$f":"IFERROR(YEAR(Calculator!C107),\"\")","v":""},{"$f":"IFERROR(VLOOKUP(MONTH(Calculator!C107),'Month mapping'!A:B,2,0),\"\")","v":""},{"$f":"Calculator!D107","v":""},{"$f":"Calculator!E107","v":""},{"$f":"Calculator!G107","v":""},{"$f":"Calculator!H107","v":""},{"$f":"Calculator!I107","v":""},{"$f":"Calculator!J107","v":""}]
[{"$f":"IFERROR(YEAR(Calculator!C108),\"\")","v":""},{"$f":"IFERROR(VLOOKUP(MONTH(Calculator!C108),'Month mapping'!A:B,2,0),\"\")","v":""},{"$f":"Calculator!D108","v":""},{"$f":"Calculator!E108","v":""},{"$f":"Calculator!G108","v":""},{"$f":"Calculator!H108","v":""},{"$f":"Calculator!I108","v":""},{"$f":"Calculator!J108","v":""}]
[{"$f":"IFERROR(YEAR(Calculator!C109),\"\")","v":""},{"$f":"IFERROR(VLOOKUP(MONTH(Calculator!C109),'Month mapping'!A:B,2,0),\"\")","v":""},{"$f":"Calculator!D109","v":""},{"$f":"Calculator!E109","v":""},{"$f":"Calculator!G109","v":""},{"$f":"Calculator!H109","v":""},{"$f":"Calculator!I109","v":""},{"$f":"Calculator!J109","v":""}]
[{"$f":"IFERROR(YEAR(Calculator!C110),\"\")","v":""},{"$f":"IFERROR(VLOOKUP(MONTH(Calculator!C110),'Month mapping'!A:B,2,0),\"\")","v":""},{"$f":"Calculator!D110","v":""},{"$f":"Calculator!E110","v":""},{"$f":"Calculator!G110","v":""},{"$f":"Calculator!H110","v":""},{"$f":"Calculator!I110","v":""},{"$f":"Calculator!J110","v":""}]
[{"$f":"IFERROR(YEAR(Calculator!C111),\"\")","v":""},{"$f":"IFERROR(VLOOKUP(MONTH(Calculator!C111),'Month mapping'!A:B,2,0),\"\")","v":""},{"$f":"Calculator!D111","v":""},{"$f":"Calculator!E111","v":""},{"$f":"Calculator!G111","v":""},{"$f":"Calculator!H111","v":""},{"$f":"Calculator!I111","v":""},{"$f":"Calculator!J111","v":""}]
[{"$f":"IFERROR(YEAR(Calculator!C112),\"\")","v":""},{"$f":"IFERROR(VLOOKUP(MONTH(Calculator!C112),'Month mapping'!A:B,2,0),\"\")","v":""},{"$f":"Calculator!D112","v":""},{"$f":"Calculator!E112","v":""},{"$f":"Calculator!G112","v":""},{"$f":"Calculator!H112","v":""},{"$f":"Calculator!I112","v":""},{"$f":"Calculator!J112","v":""}]
[{"$f":"IFERROR(YEAR(Calculator!C113),\"\")","v":""},{"$f":"IFERROR(VLOOKUP(MONTH(Calculator!C113),'Month mapping'!A:B,2,0),\"\")","v":""},{"$f":"Calculator!D113","v":""},{"$f":"Calculator!E113","v":""},{"$f":"Calculator!G113","v":""},{"$f":"Calculator!H113","v":""},{"$f":"Calculator!I113","v":""},{"$f":"Calculator!J113","v":""}]
[{"$f":"IFERROR(YEAR(Calculator!C114),\"\")","v":""},{"$f":"IFERROR(VLOOKUP(MONTH(Calculator!C114),'Month mapping'!A:B,2,0),\"\")","v":""},{"$f":"Calculator!D114","v":""},{"$f":"Calculator!E114","v":""},{"$f":"Calculator!G114","v":""},{"$f":"Calculator!H114","v":""},{"$f":"Calculator!I114","v":""},{"$f":"Calculator!J114","v":""}]
[{"$f":"IFERROR(YEAR(Calculator!C115),\"\")","v":""},{"$f":"IFERROR(VLOOKUP(MONTH(Calculator!C115),'Month mapping'!A:B,2,0),\"\")","v":""},{"$f":"Calculator!D115","v":""},{"$f":"Calculator!E115","v":""},{"$f":"Calculator!G115","v":""},{"$f":"Calculator!H115","v":""},{"$f":"Calculator!I115","v":""},{"$f":"Calculator!J115","v":""}]
[{"$f":"IFERROR(YEAR(Calculator!C116),\"\")","v":""},{"$f":"IFERROR(VLOOKUP(MONTH(Calculator!C116),'Month mapping'!A:B,2,0),\"\")","v":""},{"$f":"Calculator!D116","v":""},{"$f":"Calculator!E116","v":""},{"$f":"Calculator!G116","v":""},{"$f":"Calculator!H116","v":""},{"$f":"Calculator!I116","v":""},{"$f":"Calculator!J116","v":""}]
[{"$f":"IFERROR(YEAR(Calculator!C117),\"\")","v":""},{"$f":"IFERROR(VLOOKUP(MONTH(Calculator!C117),'Month mapping'!A:B,2,0),\"\")","v":""},{"$f":"Calculator!D117","v":""},{"$f":"Calculator!E117","v":""},{"$f":"Calculator!G117","v":""},{"$f":"Calculator!H117","v":""},{"$f":"Calculator!I117","v":""},{"$f":"Calculator!J117","v":""}]
[{"$f":"IFERROR(YEAR(Calculator!C118),\"\")","v":""},{"$f":"IFERROR(VLOOKUP(MONTH(Calculator!C118),'Month mapping'!A:B,2,0),\"\")","v":""},{"$f":"Calculator!D118","v":""},{"$f":"Calculator!E118","v":""},{"$f":"Calculator!G118","v":""},{"$f":"Calculator!H118","v":""},{"$f":"Calculator!I118","v":""},{"$f":"Calculator!J118","v":""}]
[{"$f":"IFERROR(YEAR(Calculator!C119),\"\")","v":""},{"$f":"IFERROR(VLOOKUP(MONTH(Calculator!C119),'Month mapping'!A:B,2,0),\"\")","v":""},{"$f":"Calculator!D119","v":""},{"$f":"Calculator!E119","v":""},{"$f":"Calculator!G119","v":""},{"$f":"Calculator!H119","v":""},{"$f":"Calculator!I119","v":""},{"$f":"Calculator!J119","v":""}]
[{"$f":"IFERROR(YEAR(Calculator!C120),\"\")","v":""},{"$f":"IFERROR(VLOOKUP(MONTH(Calculator!C120),'Month mapping'!A:B,2,0),\"\")","v":""},{"$f":"Calculator!D120","v":""},{"$f":"Calculator!E120","v":""},{"$f":"Calculator!G120","v":""},{"$f":"Calculator!H120","v":""},{"$f":"Calculator!I120","v":""},{"$f":"Calculator!J120","v":""}]
[{"$f":"IFERROR(YEAR(Calculator!C121),\"\")","v":""},{"$f":"IFERROR(VLOOKUP(MONTH(Calculator!C121),'Month mapping'!A:B,2,0),\"\")","v":""},{"$f":"Calculator!D121","v":""},{"$f":"Calculator!E121","v":""},{"$f":"Calculator!G121","v":""},{"$f":"Calculator!H121","v":""},{"$f":"Calculator!I121","v":""},{"$f":"Calculator!J121","v":""}]
[{"$f":"IFERROR(YEAR(Calculator!C122),\"\")","v":""},{"$f":"IFERROR(VLOOKUP(MONTH(Calculator!C122),'Month mapping'!A:B,2,0),\"\")","v":""},{"$f":"Calculator!D122","v":""},{"$f":"Calculator!E122","v":""},{"$f":"Calculator!G122","v":""},{"$f":"Calculator!H122","v":""},{"$f":"Calculator!I122","v":""},{"$f":"Calculator!J122","v":""}]
[{"$f":"IFERROR(YEAR(Calculator!C123),\"\")","v":""},{"$f":"IFERROR(VLOOKUP(MONTH(Calculator!C123),'Month mapping'!A:B,2,0),\"\")","v":""},{"$f":"Calculator!D123","v":""},{"$f":"Calculator!E123","v":""},{"$f":"Calculator!G123","v":""},{"$f":"Calculator!H123","v":""},{"$f":"Calculator!I123","v":""},{"$f":"Calculator!J123","v":""}]
[{"$f":"IFERROR(YEAR(Calculator!C124),\"\")","v":""},{"$f":"IFERROR(VLOOKUP(MONTH(Calculator!C124),'Month mapping'!A:B,2,0),\"\")","v":""},{"$f":"Calculator!D124","v":""},{"$f":"Calculator!E124","v":""},{"$f":"Calculator!G124","v":""},{"$f":"Calculator!H124","v":""},{"$f":"Calculator!I124","v":""},{"$f":"Calculator!J124","v":""}]
[{"$f":"IFERROR(YEAR(Calculator!C125),\"\")","v":""},{"$f":"IFERROR(VLOOKUP(MONTH(Calculator!C125),'Month mapping'!A:B,2,0),\"\")","v":""},{"$f":"Calculator!D125","v":""},{"$f":"Calculator!E125","v":""},{"$f":"Calculator!G125","v":""},{"$f":"Calculator!H125","v":""},{"$f":"Calculator!I125","v":""},{"$f":"Calculator!J125","v":""}]
[{"$f":"IFERROR(YEAR(Calculator!C126),\"\")","v":""},{"$f":"IFERROR(VLOOKUP(MONTH(Calculator!C126),'Month mapping'!A:B,2,0),\"\")","v":""},{"$f":"Calculator!D126","v":""},{"$f":"Calculator!E126","v":""},{"$f":"Calculator!G126","v":""},{"$f":"Calculator!H126","v":""},{"$f":"Calculator!I126","v":""},{"$f":"Calculator!J126","v":""}]
[{"$f":"IFERROR(YEAR(Calculator!C127),\"\")","v":""},{"$f":"IFERROR(VLOOKUP(MONTH(Calculator!C127),'Month mapping'!A:B,2,0),\"\")","v":""},{"$f":"Calculator!D127","v":""},{"$f":"Calculator!E127","v":""},{"$f":"Calculator!G127","v":""},{"$f":"Calculator!H127","v":""},{"$f":"Calculator!I127","v":""},{"$f":"Calculator!J127","v":""}]
[{"$f":"IFERROR(YEAR(Calculator!C128),\"\")","v":""},{"$f":"IFERROR(VLOOKUP(MONTH(Calculator!C128),'Month mapping'!A:B,2,0),\"\")","v":""},{"$f":"Calculator!D128","v":""},{"$f":"Calculator!E128","v":""},{"$f":"Calculator!G128","v":""},{"$f":"Calculator!H128","v":""},{"$f":"Calculator!I128","v":""},{"$f":"Calculator!J128","v":""}]
[{"$f":"IFERROR(YEAR(Calculator!C129),\"\")","v":""},{"$f":"IFERROR(VLOOKUP(MONTH(Calculator!C129),'Month mapping'!A:B,2,0),\"\")","v":""},{"$f":"Calculator!D129","v":""},{"$f":"Calculator!E129","v":""},{"$f":"Calculator!G129","v":""},{"$f":"Calculator!H129","v":""},{"$f":"Calculator!I129","v":""},{"$f":"Calculator!J129","v":""}]
[{"$f":"IFERROR(YEAR(Calculator!C130),\"\")","v":""},{"$f":"IFERROR(VLOOKUP(MONTH(Calculator!C130),'Month mapping'!A:B,2,0),\"\")","v":""},{"$f":"Calculator!D130","v":""},{"$f":"Calculator!E130","v":""},{"$f":"Calculator!G130","v":""},{"$f":"Calculator!H130","v":""},{"$f":"Calculator!I130","v":""},{"$f":"Calculator!J130","v":""}]
[{"$f":"IFERROR(YEAR(Calculator!C131),\"\")","v":""},{"$f":"IFERROR(VLOOKUP(MONTH(Calculator!C131),'Month mapping'!A:B,2,0),\"\")","v":""},{"$f":"Calculator!D131","v":""},{"$f":"Calculator!E131","v":""},{"$f":"Calculator!G131","v":""},{"$f":"Calculator!H131","v":""},{"$f":"Calculator!I131","v":""},{"$f":"Calculator!J131","v":""}]
[{"$f":"IFERROR(YEAR(Calculator!C132),\"\")","v":""},{"$f":"IFERROR(VLOOKUP(MONTH(Calculator!C132),'Month mapping'!A:B,2,0),\"\")","v":""},{"$f":"Calculator!D132","v":""},{"$f":"Calculator!E132","v":""},{"$f":"Calculator!G132","v":""},{"$f":"Calculator!H132","v":""},{"$f":"Calculator!I132","v":""},{"$f":"Calculator!J132","v":""}]
[{"$f":"IFERROR(YEAR(Calculator!C133),\"\")","v":""},{"$f":"IFERROR(VLOOKUP(MONTH(Calculator!C133),'Month mapping'!A:B,2,0),\"\")","v":""},{"$f":"Calculator!D133","v":""},{"$f":"Calculator!E133","v":""},{"$f":"Calculator!G133","v":""},{"$f":"Calculator!H133","v":""},{"$f":"Calculator!I133","v":""},{"$f":"Calculator!J133","v":""}]
[{"$f":"IFERROR(YEAR(Calculator!C134),\"\")","v":""},{"$f":"IFERROR(VLOOKUP(MONTH(Calculator!C134),'Month mapping'!A:B,2,0),\"\")","v":""},{"$f":"Calculator!D134","v":""},{"$f":"Calculator!E134","v":""},{"$f":"Calculator!G134","v":""},{"$f":"Calculator!H134","v":""},{"$f":"Calculator!I134","v":""},{"$f":"Calculator!J134","v":""}]
[{"$f":"IFERROR(YEAR(Calculator!C135),\"\")","v":""},{"$f":"IFERROR(VLOOKUP(MONTH(Calculator!C135),'Month mapping'!A:B,2,0),\"\")","v":""},{"$f":"Calculator!D135","v":""},{"$f":"Calculator!E135","v":""},{"$f":"Calculator!G135","v":""},{"$f":"Calculator!H135","v":""},{"$f":"Calculator!I135","v":""},{"$f":"Calculator!J135","v":""}]
[{"$f":"IFERROR(YEAR(Calculator!C136),\"\")","v":""},{"$f":"IFERROR(VLOOKUP(MONTH(Calculator!C136),'Month mapping'!A:B,2,0),\"\")","v":""},{"$f":"Calculator!D136","v":""},{"$f":"Calculator!E136","v":""},{"$f":"Calculator!G136","v":""},{"$f":"Calculator!H136","v":""},{"$f":"Calculator!I136","v":""},{"$f":"Calculator!J136","v":""}]
[{"$f":"IFERROR(YEAR(Calculator!C137),\"\")","v":""},{"$f":"IFERROR(VLOOKUP(MONTH(Calculator!C137),'Month mapping'!A:B,2,0),\"\")","v":""},{"$f":"Calculator!D137","v":""},{"$f":"Calculator!E137","v":""},{"$f":"Calculator!G137","v":""},{"$f":"Calculator!H137","v":""},{"$f":"Calculator!I137","v":""},{"$f":"Calculator!J137","v":""}]
[{"$f":"IFERROR(YEAR(Calculator!C138),\"\")","v":""},{"$f":"IFERROR(VLOOKUP(MONTH(Calculator!C138),'Month mapping'!A:B,2,0),\"\")","v":""},{"$f":"Calculator!D138","v":""},{"$f":"Calculator!E138","v":""},{"$f":"Calculator!G138","v":""},{"$f":"Calculator!H138","v":""},{"$f":"Calculator!I138","v":""},{"$f":"Calculator!J138","v":""}]
[{"$f":"IFERROR(YEAR(Calculator!C139),\"\")","v":""},{"$f":"IFERROR(VLOOKUP(MONTH(Calculator!C139),'Month mapping'!A:B,2,0),\"\")","v":""},{"$f":"Calculator!D139","v":""},{"$f":"Calculator!E139","v":""},{"$f":"Calculator!G139","v":""},{"$f":"Calculator!H139","v":""},{"$f":"Calculator!I139","v":""},{"$f":"Calculator!J139","v":""}]
[{"$f":"IFERROR(YEAR(Calculator!C140),\"\")","v":""},{"$f":"IFERROR(VLOOKUP(MONTH(Calculator!C140),'Month mapping'!A:B,2,0),\"\")","v":""},{"$f":"Calculator!D140","v":""},{"$f":"Calculator!E140","v":""},{"$f":"Calculator!G140","v":""},{"$f":"Calculator!H140","v":""},{"$f":"Calculator!I140","v":""},{"$f":"Calculator!J140","v":""}]
[{"$f":"IFERROR(YEAR(Calculator!C141),\"\")","v":""},{"$f":"IFERROR(VLOOKUP(MONTH(Calculator!C141),'Month mapping'!A:B,2,0),\"\")","v":""},{"$f":"Calculator!D141","v":""},{"$f":"Calculator!E141","v":""},{"$f":"Calculator!G141","v":""},{"$f":"Calculator!H141","v":""},{"$f":"Calculator!I141","v":""},{"$f":"Calculator!J141","v":""}]
[{"$f":"IFERROR(YEAR(Calculator!C142),\"\")","v":""},{"$f":"IFERROR(VLOOKUP(MONTH(Calculator!C142),'Month mapping'!A:B,2,0),\"\")","v":""},{"$f":"Calculator!D142","v":""},{"$f":"Calculator!E142","v":""},{"$f":"Calculator!G142","v":""},{"$f":"Calculator!H142","v":""},{"$f":"Calculator!I142","v":""},{"$f":"Calculator!J142","v":""}]
[{"$f":"IFERROR(YEAR(Calculator!C143),\"\")","v":""},{"$f":"IFERROR(VLOOKUP(MONTH(Calculator!C143),'Month mapping'!A:B,2,0),\"\")","v":""},{"$f":"Calculator!D143","v":""},{"$f":"Calculator!E143","v":""},{"$f":"Calculator!G143","v":""},{"$f":"Calculator!H143","v":""},{"$f":"Calculator!I143","v":""},{"$f":"Calculator!J143","v":""}]
[{"$f":"IFERROR(YEAR(Calculator!C144),\"\")","v":""},{"$f":"IFERROR(VLOOKUP(MONTH(Calculator!C144),'Month mapping'!A:B,2,0),\"\")","v":""},{"$f":"Calculator!D144","v":""},{"$f":"Calculator!E144","v":""},{"$f":"Calculator!G144","v":""},{"$f":"Calculator!H144","v":""},{"$f":"Calculator!I144","v":""},{"$f":"Calculator!J144","v":""}]
[{"$f":"IFERROR(YEAR(Calculator!C145),\"\")","v":""},{"$f":"IFERROR(VLOOKUP(MONTH(Calculator!C145),'Month mapping'!A:B,2,0),\"\")","v":""},{"$f":"Calculator!D145","v":""},{"$f":"Calculator!E145","v":""},{"$f":"Calculator!G145","v":""},{"$f":"Calculator!H145","v":""},{"$f":"Calculator!I145","v":""},{"$f":"Calculator!J145","v":""}]
[{"$f":"IFERROR(YEAR(Calculator!C146),\"\")","v":""},{"$f":"IFERROR(VLOOKUP(MONTH(Calculator!C146),'Month mapping'!A:B,2,0),\"\")","v":""},{"$f":"Calculator!D146","v":""},{"$f":"Calculator!E146","v":""},{"$f":"Calculator!G146","v":""},{"$f":"Calculator!H146","v":""},{"$f":"Calculator!I146","v":""},{"$f":"Calculator!J146","v":""}]
[{"$f":"IFERROR(YEAR(Calculator!C147),\"\")","v":""},{"$f":"IFERROR(VLOOKUP(MONTH(Calculator!C147),'Month mapping'!A:B,2,0),\"\")","v":""},{"$f":"Calculator!D147","v":""},{"$f":"Calculator!E147","v":""},{"$f":"Calculator!G147","v":""},{"$f":"Calculator!H147","v":""},{"$f":"Calculator!I147","v":""},{"$f":"Calculator!J147","v":""}]
[{"$f":"IFERROR(YEAR(Calculator!C148),\"\")","v":""},{"$f":"IFERROR(VLOOKUP(MONTH(Calculator!C148),'Month mapping'!A:B,2,0),\"\")","v":""},{"$f":"Calculator!D148","v":""},{"$f":"Calculator!E148","v":""},{"$f":"Calculator!G148","v":""},{"$f":"Calculator!H148","v":""},{"$f":"Calculator!I148","v":""},{"$f":"Calculator!J148","v":""}]
[{"$f":"IFERROR(YEAR(Calculator!C149),\"\")","v":""},{"$f":"IFERROR(VLOOKUP(MONTH(Calculator!C149),'Month mapping'!A:B,2,0),\"\")","v":""},{"$f":"Calculator!D149","v":""},{"$f":"Calculator!E149","v":""},{"$f":"Calculator!G149","v":""},{"$f":"Calculator!H149","v":""},{"$f":"Calculator!I149","v":""},{"$f":"Calculator!J149","v":""}]
[{"$f":"IFERROR(YEAR(Calculator!C150),\"\")","v":""},{"$f":"IFERROR(VLOOKUP(MONTH(Calculator!C150),'Month mapping'!A:B,2,0),\"\")","v":""},{"$f":"Calculator!D150","v":""},{"$f":"Calculator!E150","v":""},{"$f":"Calculator!G150","v":""},{"$f":"Calculator!H150","v":""},{"$f":"Calculator!I150","v":""},{"$f":"Calculator!J150","v":""}]
[{"$f":"IFERROR(YEAR(Calculator!C151),\"\")","v":""},{"$f":"IFERROR(VLOOKUP(MONTH(Calculator!C151),'Month mapping'!A:B,2,0),\"\")","v":""},{"$f":"Calculator!D151","v":""},{"$f":"Calculator!E151","v":""},{"$f":"Calculator!G151","v":""},{"$f":"Calculator!H151","v":""},{"$f":"Calculator!I151","v":""},{"$f":"Calculator!J151","v":""}]
[{"$f":"IFERROR(YEAR(Calculator!C152),\"\")","v":""},{"$f":"IFERROR(VLOOKUP(MONTH(Calculator!C152),'Month mapping'!A:B,2,0),\"\")","v":""},{"$f":"Calculator!D152","v":""},{"$f":"Calculator!E152","v":""},{"$f":"Calculator!G152","v":""},{"$f":"Calculator!H152","v":""},{"$f":"Calculator!I152","v":""},{"$f":"Calculator!J152","v":""}]
[{"$f":"IFERROR(YEAR(Calculator!C153),\"\")","v":""},{"$f":"IFERROR(VLOOKUP(MONTH(Calculator!C153),'Month mapping'!A:B,2,0),\"\")","v":""},{"$f":"Calculator!D153","v":""},{"$f":"Calculator!E153","v":""},{"$f":"Calculator!G153","v":""},{"$f":"Calculator!H153","v":""},{"$f":"Calculator!I153","v":""},{"$f":"Calculator!J153","v":""}]
[{"$f":"IFERROR(YEAR(Calculator!C154),\"\")","v":""},{"$f":"IFERROR(VLOOKUP(MONTH(Calculator!C154),'Month mapping'!A:B,2,0),\"\")","v":""},{"$f":"Calculator!D154","v":""},{"$f":"Calculator!E154","v":""},{"$f":"Calculator!G154","v":""},{"$f":"Calculator!H154","v":""},{"$f":"Calculator!I154","v":""},{"$f":"Calculator!J154","v":""}]
[{"$f":"IFERROR(YEAR(Calculator!C155),\"\")","v":""},{"$f":"IFERROR(VLOOKUP(MONTH(Calculator!C155),'Month mapping'!A:B,2,0),\"\")","v":""},{"$f":"Calculator!D155","v":""},{"$f":"Calculator!E155","v":""},{"$f":"Calculator!G155","v":""},{"$f":"Calculator!H155","v":""},{"$f":"Calculator!I155","v":""},{"$f":"Calculator!J155","v":""}]
[{"$f":"IFERROR(YEAR(Calculator!C156),\"\")","v":""},{"$f":"IFERROR(VLOOKUP(MONTH(Calculator!C156),'Month mapping'!A:B,2,0),\"\")","v":""},{"$f":"Calculator!D156","v":""},{"$f":"Calculator!E156","v":""},{"$f":"Calculator!G156","v":""},{"$f":"Calculator!H156","v":""},{"$f":"Calculator!I156","v":""},{"$f":"Calculator!J156","v":""}]
[{"$f":"IFERROR(YEAR(Calculator!C157),\"\")","v":""},{"$f":"IFERROR(VLOOKUP(MONTH(Calculator!C157),'Month mapping'!A:B,2,0),\"\")","v":""},{"$f":"Calculator!D157","v":""},{"$f":"Calculator!E157","v":""},{"$f":"Calculator!G157","v":""},{"$f":"Calculator!H157","v":""},{"$f":"Calculator!I157","v":""},{"$f":"Calculator!J157","v":""}]
[{"$f":"IFERROR(YEAR(Calculator!C158),\"\")","v":""},{"$f":"IFERROR(VLOOKUP(MONTH(Calculator!C158),'Month mapping'!A:B,2,0),\"\")","v":""},{"$f":"Calculator!D158","v":""},{"$f":"Calculator!E158","v":""},{"$f":"Calculator!G158","v":""},{"$f":"Calculator!H158","v":""},{"$f":"Calculator!I158","v":""},{"$f":"Calculator!J158","v":""}]
[{"$f":"IFERROR(YEAR(Calculator!C159),\"\")","v":""},{"$f":"IFERROR(VLOOKUP(MONTH(Calculator!C159),'Month mapping'!A:B,2,0),\"\")","v":""},{"$f":"Calculator!D159","v":""},{"$f":"Calculator!E159","v":""},{"$f":"Calculator!G159","v":""},{"$f":"Calculator!H159","v":""},{"$f":"Calculator!I159","v":""},{"$f":"Calculator!J159","v":""}]
[{"$f":"IFERROR(YEAR(Calculator!C160),\"\")","v":""},{"$f":"IFERROR(VLOOKUP(MONTH(Calculator!C160),'Month mapping'!A:B,2,0),\"\")","v":""},{"$f":"Calculator!D160","v":""},{"$f":"Calculator!E160","v":""},{"$f":"Calculator!G160","v":""},{"$f":"Calculator!H160","v":""},{"$f":"Calculator!I160","v":""},{"$f":"Calculator!J160","v":""}]
[{"$f":"IFERROR(YEAR(Calculator!C161),\"\")","v":""},{"$f":"IFERROR(VLOOKUP(MONTH(Calculator!C161),'Month mapping'!A:B,2,0),\"\")","v":""},{"$f":"Calculator!D161","v":""},{"$f":"Calculator!E161","v":""},{"$f":"Calculator!G161","v":""},{"$f":"Calculator!H161","v":""},{"$f":"Calculator!I161","v":""},{"$f":"Calculator!J161","v":""}]
[{"$f":"IFERROR(YEAR(Calculator!C162),\"\")","v":""},{"$f":"IFERROR(VLOOKUP(MONTH(Calculator!C162),'Month mapping'!A:B,2,0),\"\")","v":""},{"$f":"Calculator!D162","v":""},{"$f":"Calculator!E162","v":""},{"$f":"Calculator!G162","v":""},{"$f":"Calculator!H162","v":""},{"$f":"Calculator!I162","v":""},{"$f":"Calculator!J162","v":""}]
[{"$f":"IFERROR(YEAR(Calculator!C163),\"\")","v":""},{"$f":"IFERROR(VLOOKUP(MONTH(Calculator!C163),'Month mapping'!A:B,2,0),\"\")","v":""},{"$f":"Calculator!D163","v":""},{"$f":"Calculator!E163","v":""},{"$f":"Calculator!G163","v":""},{"$f":"Calculator!H163","v":""},{"$f":"Calculator!I163","v":""},{"$f":"Calculator!J163","v":""}]
[{"$f":"IFERROR(YEAR(Calculator!C164),\"\")","v":""},{"$f":"IFERROR(VLOOKUP(MONTH(Calculator!C164),'Month mapping'!A:B,2,0),\"\")","v":""},{"$f":"Calculator!D164","v":""},{"$f":"Calculator!E164","v":""},{"$f":"Calculator!G164","v":""},{"$f":"Calculator!H164","v":""},{"$f":"Calculator!I164","v":""},{"$f":"Calculator!J164","v":""}]
[{"$f":"IFERROR(YEAR(Calculator!C165),\"\")","v":""},{"$f":"IFERROR(VLOOKUP(MONTH(Calculator!C165),'Month mapping'!A:B,2,0),\"\")","v":""},{"$f":"Calculator!D165","v":""},{"$f":"Calculator!E165","v":""},{"$f":"Calculator!G165","v":""},{"$f":"Calculator!H165","v":""},{"$f":"Calculator!I165","v":""},{"$f":"Calculator!J165","v":""}]
[{"$f":"IFERROR(YEAR(Calculator!C166),\"\")","v":""},{"$f":"IFERROR(VLOOKUP(MONTH(Calculator!C166),'Month mapping'!A:B,2,0),\"\")","v":""},{"$f":"Calculator!D166","v":""},{"$f":"Calculator!E166","v":""},{"$f":"Calculator!G166","v":""},{"$f":"Calculator!H166","v":""},{"$f":"Calculator!I166","v":""},{"$f":"Calculator!J166","v":""}]
[{"$f":"IFERROR(YEAR(Calculator!C167),\"\")","v":""},{"$f":"IFERROR(VLOOKUP(MONTH(Calculator!C167),'Month mapping'!A:B,2,0),\"\")","v":""},{"$f":"Calculator!D167","v":""},{"$f":"Calculator!E167","v":""},{"$f":"Calculator!G167","v":""},{"$f":"Calculator!H167","v":""},{"$f":"Calculator!I167","v":""},{"$f":"Calculator!J167","v":""}]
[{"$f":"IFERROR(YEAR(Calculator!C168),\"\")","v":""},{"$f":"IFERROR(VLOOKUP(MONTH(Calculator!C168),'Month mapping'!A:B,2,0),\"\")","v":""},{"$f":"Calculator!D168","v":""},{"$f":"Calculator!E168","v":""},{"$f":"Calculator!G168","v":""},{"$f":"Calculator!H168","v":""},{"$f":"Calculator!I168","v":""},{"$f":"Calculator!J168","v":""}]
[{"$f":"IFERROR(YEAR(Calculator!C169),\"\")","v":""},{"$f":"IFERROR(VLOOKUP(MONTH(Calculator!C169),'Month mapping'!A:B,2,0),\"\")","v":""},{"$f":"Calculator!D169","v":""},{"$f":"Calculator!E169","v":""},{"$f":"Calculator!G169","v":""},{"$f":"Calculator!H169","v":""},{"$f":"Calculator!I169","v":""},{"$f":"Calculator!J169","v":""}]
[{"$f":"IFERROR(YEAR(Calculator!C170),\"\")","v":""},{"$f":"IFERROR(VLOOKUP(MONTH(Calculator!C170),'Month mapping'!A:B,2,0),\"\")","v":""},{"$f":"Calculator!D170","v":""},{"$f":"Calculator!E170","v":""},{"$f":"Calculator!G170","v":""},{"$f":"Calculator!H170","v":""},{"$f":"Calculator!I170","v":""},{"$f":"Calculator!J170","v":""}]
[{"$f":"IFERROR(YEAR(Calculator!C171),\"\")","v":""},{"$f":"IFERROR(VLOOKUP(MONTH(Calculator!C171),'Month mapping'!A:B,2,0),\"\")","v":""},{"$f":"Calculator!D171","v":""},{"$f":"Calculator!E171","v":""},{"$f":"Calculator!G171","v":""},{"$f":"Calculator!H171","v":""},{"$f":"Calculator!I171","v":""},{"$f":"Calculator!J171","v":""}]
[{"$f":"IFERROR(YEAR(Calculator!C172),\"\")","v":""},{"$f":"IFERROR(VLOOKUP(MONTH(Calculator!C172),'Month mapping'!A:B,2,0),\"\")","v":""},{"$f":"Calculator!D172","v":""},{"$f":"Calculator!E172","v":""},{"$f":"Calculator!G172","v":""},{"$f":"Calculator!H172","v":""},{"$f":"Calculator!I172","v":""},{"$f":"Calculator!J172","v":""}]
[{"$f":"IFERROR(YEAR(Calculator!C173),\"\")","v":""},{"$f":"IFERROR(VLOOKUP(MONTH(Calculator!C173),'Month mapping'!A:B,2,0),\"\")","v":""},{"$f":"Calculator!D173","v":""},{"$f":"Calculator!E173","v":""},{"$f":"Calculator!G173","v":""},{"$f":"Calculator!H173","v":""},{"$f":"Calculator!I173","v":""},{"$f":"Calculator!J173","v":""}]
[{"$f":"IFERROR(YEAR(Calculator!C174),\"\")","v":""},{"$f":"IFERROR(VLOOKUP(MONTH(Calculator!C174),'Month mapping'!A:B,2,0),\"\")","v":""},{"$f":"Calculator!D174","v":""},{"$f":"Calculator!E174","v":""},{"$f":"Calculator!G174","v":""},{"$f":"Calculator!H174","v":""},{"$f":"Calculator!I174","v":""},{"$f":"Calculator!J174","v":""}]
[{"$f":"IFERROR(YEAR(Calculator!C175),\"\")","v":""},{"$f":"IFERROR(VLOOKUP(MONTH(Calculator!C175),'Month mapping'!A:B,2,0),\"\")","v":""},{"$f":"Calculator!D175","v":""},{"$f":"Calculator!E175","v":""},{"$f":"Calculator!G175","v":""},{"$f":"Calculator!H175","v":""},{"$f":"Calculator!I175","v":""},{"$f":"Calculator!J175","v":""}]
[{"$f":"IFERROR(YEAR(Calculator!C176),\"\")","v":""},{"$f":"IFERROR(VLOOKUP(MONTH(Calculator!C176),'Month mapping'!A:B,2,0),\"\")","v":""},{"$f":"Calculator!D176","v":""},{"$f":"Calculator!E176","v":""},{"$f":"Calculator!G176","v":""},{"$f":"Calculator!H176","v":""},{"$f":"Calculator!I176","v":""},{"$f":"Calculator!J176","v":""}]
[{"$f":"IFERROR(YEAR(Calculator!C177),\"\")","v":""},{"$f":"IFERROR(VLOOKUP(MONTH(Calculator!C177),'Month mapping'!A:B,2,0),\"\")","v":""},{"$f":"Calculator!D177","v":""},{"$f":"Calculator!E177","v":""},{"$f":"Calculator!G177","v":""},{"$f":"Calculator!H177","v":""},{"$f":"Calculator!I177","v":""},{"$f":"Calculator!J177","v":""}]
[{"$f":"IFERROR(YEAR(Calculator!C178),\"\")","v":""},{"$f":"IFERROR(VLOOKUP(MONTH(Calculator!C178),'Month mapping'!A:B,2,0),\"\")","v":""},{"$f":"Calculator!D178","v":""},{"$f":"Calculator!E178","v":""},{"$f":"Calculator!G178","v":""},{"$f":"Calculator!H178","v":""},{"$f":"Calculator!I178","v":""},{"$f":"Calculator!J178","v":""}]
[{"$f":"IFERROR(YEAR(Calculator!C179),\"\")","v":""},{"$f":"IFERROR(VLOOKUP(MONTH(Calculator!C179),'Month mapping'!A:B,2,0),\"\")","v":""},{"$f":"Calculator!D179","v":""},{"$f":"Calculator!E179","v":""},{"$f":"Calculator!G179","v":""},{"$f":"Calculator!H179","v":""},{"$f":"Calculator!I179","v":""},{"$f":"Calculator!J179","v":""}]
[{"$f":"IFERROR(YEAR(Calculator!C180),\"\")","v":""},{"$f":"IFERROR(VLOOKUP(MONTH(Calculator!C180),'Month mapping'!A:B,2,0),\"\")","v":""},{"$f":"Calculator!D180","v":""},{"$f":"Calculator!E180","v":""},{"$f":"Calculator!G180","v":""},{"$f":"Calculator!H180","v":""},{"$f":"Calculator!I180","v":""},{"$f":"Calculator!J180","v":""}]
[{"$f":"IFERROR(YEAR(Calculator!C181),\"\")","v":""},{"$f":"IFERROR(VLOOKUP(MONTH(Calculator!C181),'Month mapping'!A:B,2,0),\"\")","v":""},{"$f":"Calculator!D181","v":""},{"$f":"Calculator!E181","v":""},{"$f":"Calculator!G181","v":""},{"$f":"Calculator!H181","v":""},{"$f":"Calculator!I181","v":""},{"$f":"Calculator!J181","v":""}]
[{"$f":"IFERROR(YEAR(Calculator!C182),\"\")","v":""},{"$f":"IFERROR(VLOOKUP(MONTH(Calculator!C182),'Month mapping'!A:B,2,0),\"\")","v":""},{"$f":"Calculator!D182","v":""},{"$f":"Calculator!E182","v":""},{"$f":"Calculator!G182","v":""},{"$f":"Calculator!H182","v":""},{"$f":"Calculator!I182","v":""},{"$f":"Calculator!J182","v":""}]
[{"$f":"IFERROR(YEAR(Calculator!C183),\"\")","v":""},{"$f":"IFERROR(VLOOKUP(MONTH(Calculator!C183),'Month mapping'!A:B,2,0),\"\")","v":""},{"$f":"Calculator!D183","v":""},{"$f":"Calculator!E183","v":""},{"$f":"Calculator!G183","v":""},{"$f":"Calculator!H183","v":""},{"$f":"Calculator!I183","v":""},{"$f":"Calculator!J183","v":""}]
[{"$f":"IFERROR(YEAR(Calculator!C184),\"\")","v":""},{"$f":"IFERROR(VLOOKUP(MONTH(Calculator!C184),'Month mapping'!A:B,2,0),\"\")","v":""},{"$f":"Calculator!D184","v":""},{"$f":"Calculator!E184","v":""},{"$f":"Calculator!G184","v":""},{"$f":"Calculator!H184","v":""},{"$f":"Calculator!I184","v":""},{"$f":"Calculator!J184","v":""}]
[{"$f":"IFERROR(YEAR(Calculator!C185),\"\")","v":""},{"$f":"IFERROR(VLOOKUP(MONTH(Calculator!C185),'Month mapping'!A:B,2,0),\"\")","v":""},{"$f":"Calculator!D185","v":""},{"$f":"Calculator!E185","v":""},{"$f":"Calculator!G185","v":""},{"$f":"Calculator!H185","v":""},{"$f":"Calculator!I185","v":""},{"$f":"Calculator!J185","v":""}]
[{"$f":"IFERROR(YEAR(Calculator!C186),\"\")","v":""},{"$f":"IFERROR(VLOOKUP(MONTH(Calculator!C186),'Month mapping'!A:B,2,0),\"\")","v":""},{"$f":"Calculator!D186","v":""},{"$f":"Calculator!E186","v":""},{"$f":"Calculator!G186","v":""},{"$f":"Calculator!H186","v":""},{"$f":"Calculator!I186","v":""},{"$f":"Calculator!J186","v":""}]
[{"$f":"IFERROR(YEAR(Calculator!C187),\"\")","v":""},{"$f":"IFERROR(VLOOKUP(MONTH(Calculator!C187),'Month mapping'!A:B,2,0),\"\")","v":""},{"$f":"Calculator!D187","v":""},{"$f":"Calculator!E187","v":""},{"$f":"Calculator!G187","v":""},{"$f":"Calculator!H187","v":""},{"$f":"Calculator!I187","v":""},{"$f":"Calculator!J187","v":""}]
[{"$f":"IFERROR(YEAR(Calculator!C188),\"\")","v":""},{"$f":"IFERROR(VLOOKUP(MONTH(Calculator!C188),'Month mapping'!A:B,2,0),\"\")","v":""},{"$f":"Calculator!D188","v":""},{"$f":"Calculator!E188","v":""},{"$f":"Calculator!G188","v":""},{"$f":"Calculator!H188","v":""},{"$f":"Calculator!I188","v":""},{"$f":"Calculator!J188","v":""}]
[{"$f":"IFERROR(YEAR(Calculator!C189),\"\")","v":""},{"$f":"IFERROR(VLOOKUP(MONTH(Calculator!C189),'Month mapping'!A:B,2,0),\"\")","v":""},{"$f":"Calculator!D189","v":""},{"$f":"Calculator!E189","v":""},{"$f":"Calculator!G189","v":""},{"$f":"Calculator!H189","v":""},{"$f":"Calculator!I189","v":""},{"$f":"Calculator!J189","v":""}]
[{"$f":"IFERROR(YEAR(Calculator!C190),\"\")","v":""},{"$f":"IFERROR(VLOOKUP(MONTH(Calculator!C190),'Month mapping'!A:B,2,0),\"\")","v":""},{"$f":"Calculator!D190","v":""},{"$f":"Calculator!E190","v":""},{"$f":"Calculator!G190","v":""},{"$f":"Calculator!H190","v":""},{"$f":"Calculator!I190","v":""},{"$f":"Calculator!J190","v":""}]
[{"$f":"IFERROR(YEAR(Calculator!C191),\"\")","v":""},{"$f":"IFERROR(VLOOKUP(MONTH(Calculator!C191),'Month mapping'!A:B,2,0),\"\")","v":""},{"$f":"Calculator!D191","v":""},{"$f":"Calculator!E191","v":""},{"$f":"Calculator!G191","v":""},{"$f":"Calculator!H191","v":""},{"$f":"Calculator!I191","v":""},{"$f":"Calculator!J191","v":""}]
[{"$f":"IFERROR(YEAR(Calculator!C192),\"\")","v":""},{"$f":"IFERROR(VLOOKUP(MONTH(Calculator!C192),'Month mapping'!A:B,2,0),\"\")","v":""},{"$f":"Calculator!D192","v":""},{"$f":"Calculator!E192","v":""},{"$f":"Calculator!G192","v":""},{"$f":"Calculator!H192","v":""},{"$f":"Calculator!I192","v":""},{"$f":"Calculator!J192","v":""}]
[{"$f":"IFERROR(YEAR(Calculator!C193),\"\")","v":""},{"$f":"IFERROR(VLOOKUP(MONTH(Calculator!C193),'Month mapping'!A:B,2,0),\"\")","v":""},{"$f":"Calculator!D193","v":""},{"$f":"Calculator!E193","v":""},{"$f":"Calculator!G193","v":""},{"$f":"Calculator!H193","v":""},{"$f":"Calculator!I193","v":""},{"$f":"Calculator!J193","v":""}]
[{"$f":"IFERROR(YEAR(Calculator!C194),\"\")","v":""},{"$f":"IFERROR(VLOOKUP(MONTH(Calculator!C194),'Month mapping'!A:B,2,0),\"\")","v":""},{"$f":"Calculator!D194","v":""},{"$f":"Calculator!E194","v":""},{"$f":"Calculator!G194","v":""},{"$f":"Calculator!H194","v":""},{"$f":"Calculator!I194","v":""},{"$f":"Calculator!J194","v":""}]
[{"$f":"IFERROR(YEAR(Calculator!C195),\"\")","v":""},{"$f":"IFERROR(VLOOKUP(MONTH(Calculator!C195),'Month mapping'!A:B,2,0),\"\")","v":""},{"$f":"Calculator!D195","v":""},{"$f":"Calculator!E195","v":""},{"$f":"Calculator!G195","v":""},{"$f":"Calculator!H195","v":""},{"$f":"Calculator!I195","v":""},{"$f":"Calculator!J195","v":""}]
[{"$f":"IFERROR(YEAR(Calculator!C196),\"\")","v":""},{"$f":"IFERROR(VLOOKUP(MONTH(Calculator!C196),'Month mapping'!A:B,2,0),\"\")","v":""},{"$f":"Calculator!D196","v":""},{"$f":"Calculator!E196","v":""},{"$f":"Calculator!G196","v":""},{"$f":"Calculator!H196","v":""},{"$f":"Calculator!I196","v":""},{"$f":"Calculator!J196","v":""}]
[{"$f":"IFERROR(YEAR(Calculator!C197),\"\")","v":""},{"$f":"IFERROR(VLOOKUP(MONTH(Calculator!C197),'Month mapping'!A:B,2,0),\"\")","v":""},{"$f":"Calculator!D197","v":""},{"$f":"Calculator!E197","v":""},{"$f":"Calculator!G197","v":""},{"$f":"Calculator!H197","v":""},{"$f":"Calculator!I197","v":""},{"$f":"Calculator!J197","v":""}]
[{"$f":"IFERROR(YEAR(Calculator!C198),\"\")","v":""},{"$f":"IFERROR(VLOOKUP(MONTH(Calculator!C198),'Month mapping'!A:B,2,0),\"\")","v":""},{"$f":"Calculator!D198","v":""},{"$f":"Calculator!E198","v":""},{"$f":"Calculator!G198","v":""},{"$f":"Calculator!H198","v":""},{"$f":"Calculator!I198","v":""},{"$f":"Calculator!J198","v":""}]
[{"$f":"IFERROR(YEAR(Calculator!C199),\"\")","v":""},{"$f":"IFERROR(VLOOKUP(MONTH(Calculator!C199),'Month mapping'!A:B,2,0),\"\")","v":""},{"$f":"Calculator!D199","v":""},{"$f":"Calculator!E199","v":""},{"$f":"Calculator!G199","v":""},{"$f":"Calculator!H199","v":""},{"$f":"Calculator!I199","v":""},{"$f":"Calculator!J199","v":""}]
[{"$f":"IFERROR(YEAR(Calculator!C200),\"\")","v":""},{"$f":"IFERROR(VLOOKUP(MONTH(Calculator!C200),'Month mapping'!A:B,2,0),\"\")","v":""},{"$f":"Calculator!D200","v":""},{"$f":"Calculator!E200","v":""},{"$f":"Calculator!G200","v":""},{"$f":"Calculator!H200","v":""},{"$f":"Calculator!I200","v":""},{"$f":"Calculator!J200","v":""}]
[{"$f":"IFERROR(YEAR(Calculator!C201),\"\")","v":""},{"$f":"IFERROR(VLOOKUP(MONTH(Calculator!C201),'Month mapping'!A:B,2,0),\"\")","v":""},{"$f":"Calculator!D201","v":""},{"$f":"Calculator!E201","v":""},{"$f":"Calculator!G201","v":""},{"$f":"Calculator!H201","v":""},{"$f":"Calculator!I201","v":""},{"$f":"Calculator!J201","v":""}]
[{"$f":"IFERROR(YEAR(Calculator!C202),\"\")","v":""},{"$f":"IFERROR(VLOOKUP(MONTH(Calculator!C202),'Month mapping'!A:B,2,0),\"\")","v":""},{"$f":"Calculator!D202","v":""},{"$f":"Calculator!E202","v":""},{"$f":"Calculator!G202","v":""},{"$f":"Calculator!H202","v":""},{"$f":"Calculator!I202","v":""},{"$f":"Calculator!J202","v":""}]
[{"$f":"IFERROR(YEAR(Calculator!C203),\"\")","v":""},{"$f":"IFERROR(VLOOKUP(MONTH(Calculator!C203),'Month mapping'!A:B,2,0),\"\")","v":""},{"$f":"Calculator!D203","v":""},{"$f":"Calculator!E203","v":""},{"$f":"Calculator!G203","v":""},{"$f":"Calculator!H203","v":""},{"$f":"Calculator!I203","v":""},{"$f":"Calculator!J203","v":""}]
[{"$f":"IFERROR(YEAR(Calculator!C204),\"\")","v":""},{"$f":"IFERROR(VLOOKUP(MONTH(Calculator!C204),'Month mapping'!A:B,2,0),\"\")","v":""},{"$f":"Calculator!D204","v":""},{"$f":"Calculator!E204","v":""},{"$f":"Calculator!G204","v":""},{"$f":"Calculator!H204","v":""},{"$f":"Calculator!I204","v":""},{"$f":"Calculator!J204","v":""}]
[{"$f":"IFERROR(YEAR(Calculator!C205),\"\")","v":""},{"$f":"IFERROR(VLOOKUP(MONTH(Calculator!C205),'Month mapping'!A:B,2,0),\"\")","v":""},{"$f":"Calculator!D205","v":""},{"$f":"Calculator!E205","v":""},{"$f":"Calculator!G205","v":""},{"$f":"Calculator!H205","v":""},{"$f":"Calculator!I205","v":""},{"$f":"Calculator!J205","v":""}]
[{"$f":"IFERROR(YEAR(Calculator!C206),\"\")","v":""},{"$f":"IFERROR(VLOOKUP(MONTH(Calculator!C206),'Month mapping'!A:B,2,0),\"\")","v":""},{"$f":"Calculator!D206","v":""},{"$f":"Calculator!E206","v":""},{"$f":"Calculator!G206","v":""},{"$f":"Calculator!H206","v":""},{"$f":"Calculator!I206","v":""},{"$f":"Calculator!J206","v":""}]
[{"$f":"IFERROR(YEAR(Calculator!C207),\"\")","v":""},{"$f":"IFERROR(VLOOKUP(MONTH(Calculator!C207),'Month mapping'!A:B,2,0),\"\")","v":""},{"$f":"Calculator!D207","v":""},{"$f":"Calculator!E207","v":""},{"$f":"Calculator!G207","v":""},{"$f":"Calculator!H207","v":""},{"$f":"Calculator!I207","v":""},{"$f":"Calculator!J207","v":""}]
[{"$f":"IFERROR(YEAR(Calculator!C208),\"\")","v":""},{"$f":"IFERROR(VLOOKUP(MONTH(Calculator!C208),'Month mapping'!A:B,2,0),\"\")","v":""},{"$f":"Calculator!D208","v":""},{"$f":"Calculator!E208","v":""},{"$f":"Calculator!G208","v":""},{"$f":"Calculator!H208","v":""},{"$f":"Calculator!I208","v":""},{"$f":"Calculator!J208","v":""}]
[{"$f":"IFERROR(YEAR(Calculator!C209),\"\")","v":""},{"$f":"IFERROR(VLOOKUP(MONTH(Calculator!C209),'Month mapping'!A:B,2,0),\"\")","v":""},{"$f":"Calculator!D209","v":""},{"$f":"Calculator!E209","v":""},{"$f":"Calculator!G209","v":""},{"$f":"Calculator!H209","v":""},{"$f":"Calculator!I209","v":""},{"$f":"Calculator!J209","v":""}]
[{"$f":"IFERROR(YEAR(Calculator!C210),\"\")","v":""},{"$f":"IFERROR(VLOOKUP(MONTH(Calculator!C210),'Month mapping'!A:B,2,0),\"\")","v":""},{"$f":"Calculator!D210","v":""},{"$f":"Calculator!E210","v":""},{"$f":"Calculator!G210","v":""},{"$f":"Calculator!H210","v":""},{"$f":"Calculator!I210","v":""},{"$f":"Calculator!J210","v":""}]
[{"$f":"IFERROR(YEAR(Calculator!C211),\"\")","v":""},{"$f":"IFERROR(VLOOKUP(MONTH(Calculator!C211),'Month mapping'!A:B,2,0),\"\")","v":""},{"$f":"Calculator!D211","v":""},{"$f":"Calculator!E211","v":""},{"$f":"Calculator!G211","v":""},{"$f":"Calculator!H211","v":""},{"$f":"Calculator!I211","v":""},{"$f":"Calculator!J211","v":""}]
[{"$f":"IFERROR(YEAR(Calculator!C212),\"\")","v":""},{"$f":"IFERROR(VLOOKUP(MONTH(Calculator!C212),'Month mapping'!A:B,2,0),\"\")","v":""},{"$f":"Calculator!D212","v":""},{"$f":"Calculator!E212","v":""},{"$f":"Calculator!G212","v":""},{"$f":"Calculator!H212","v":""},{"$f":"Calculator!I212","v":""},{"$f":"Calculator!J212","v":""}]
[{"$f":"IFERROR(YEAR(Calculator!C213),\"\")","v":""},{"$f":"IFERROR(VLOOKUP(MONTH(Calculator!C213),'Month mapping'!A:B,2,0),\"\")","v":""},{"$f":"Calculator!D213","v":""},{"$f":"Calculator!E213","v":""},{"$f":"Calculator!G213","v":""},{"$f":"Calculator!H213","v":""},{"$f":"Calculator!I213","v":""},{"$f":"Calculator!J213","v":""}]
[{"$f":"IFERROR(YEAR(Calculator!C214),\"\")","v":""},{"$f":"IFERROR(VLOOKUP(MONTH(Calculator!C214),'Month mapping'!A:B,2,0),\"\")","v":""},{"$f":"Calculator!D214","v":""},{"$f":"Calculator!E214","v":""},{"$f":"Calculator!G214","v":""},{"$f":"Calculator!H214","v":""},{"$f":"Calculator!I214","v":""},{"$f":"Calculator!J214","v":""}]
[{"$f":"IFERROR(YEAR(Calculator!C215),\"\")","v":""},{"$f":"IFERROR(VLOOKUP(MONTH(Calculator!C215),'Month mapping'!A:B,2,0),\"\")","v":""},{"$f":"Calculator!D215","v":""},{"$f":"Calculator!E215","v":""},{"$f":"Calculator!G215","v":""},{"$f":"Calculator!H215","v":""},{"$f":"Calculator!I215","v":""},{"$f":"Calculator!J215","v":""}]
[{"$f":"IFERROR(YEAR(Calculator!C216),\"\")","v":""},{"$f":"IFERROR(VLOOKUP(MONTH(Calculator!C216),'Month mapping'!A:B,2,0),\"\")","v":""},{"$f":"Calculator!D216","v":""},{"$f":"Calculator!E216","v":""},{"$f":"Calculator!G216","v":""},{"$f":"Calculator!H216","v":""},{"$f":"Calculator!I216","v":""},{"$f":"Calculator!J216","v":""}]
[{"$f":"IFERROR(YEAR(Calculator!C217),\"\")","v":""},{"$f":"IFERROR(VLOOKUP(MONTH(Calculator!C217),'Month mapping'!A:B,2,0),\"\")","v":""},{"$f":"Calculator!D217","v":""},{"$f":"Calculator!E217","v":""},{"$f":"Calculator!G217","v":""},{"$f":"Calculator!H217","v":""},{"$f":"Calculator!I217","v":""},{"$f":"Calculator!J217","v":""}]
[{"$f":"IFERROR(YEAR(Calculator!C218),\"\")","v":""},{"$f":"IFERROR(VLOOKUP(MONTH(Calculator!C218),'Month mapping'!A:B,2,0),\"\")","v":""},{"$f":"Calculator!D218","v":""},{"$f":"Calculator!E218","v":""},{"$f":"Calculator!G218","v":""},{"$f":"Calculator!H218","v":""},{"$f":"Calculator!I218","v":""},{"$f":"Calculator!J218","v":""}]
[{"$f":"IFERROR(YEAR(Calculator!C219),\"\")","v":""},{"$f":"IFERROR(VLOOKUP(MONTH(Calculator!C219),'Month mapping'!A:B,2,0),\"\")","v":""},{"$f":"Calculator!D219","v":""},{"$f":"Calculator!E219","v":""},{"$f":"Calculator!G219","v":""},{"$f":"Calculator!H219","v":""},{"$f":"Calculator!I219","v":""},{"$f":"Calculator!J219","v":""}]
[{"$f":"IFERROR(YEAR(Calculator!C220),\"\")","v":""},{"$f":"IFERROR(VLOOKUP(MONTH(Calculator!C220),'Month mapping'!A:B,2,0),\"\")","v":""},{"$f":"Calculator!D220","v":""},{"$f":"Calculator!E220","v":""},{"$f":"Calculator!G220","v":""},{"$f":"Calculator!H220","v":""},{"$f":"Calculator!I220","v":""},{"$f":"Calculator!J220","v":""}]
[{"$f":"IFERROR(YEAR(Calculator!C221),\"\")","v":""},{"$f":"IFERROR(VLOOKUP(MONTH(Calculator!C221),'Month mapping'!A:B,2,0),\"\")","v":""},{"$f":"Calculator!D221","v":""},{"$f":"Calculator!E221","v":""},{"$f":"Calculator!G221","v":""},{"$f":"Calculator!H221","v":""},{"$f":"Calculator!I221","v":""},{"$f":"Calculator!J221","v":""}]
[{"$f":"IFERROR(YEAR(Calculator!C222),\"\")","v":""},{"$f":"IFERROR(VLOOKUP(MONTH(Calculator!C222),'Month mapping'!A:B,2,0),\"\")","v":""},{"$f":"Calculator!D222","v":""},{"$f":"Calculator!E222","v":""},{"$f":"Calculator!G222","v":""},{"$f":"Calculator!H222","v":""},{"$f":"Calculator!I222","v":""},{"$f":"Calculator!J222","v":""}]
[{"$f":"IFERROR(YEAR(Calculator!C223),\"\")","v":""},{"$f":"IFERROR(VLOOKUP(MONTH(Calculator!C223),'Month mapping'!A:B,2,0),\"\")","v":""},{"$f":"Calculator!D223","v":""},{"$f":"Calculator!E223","v":""},{"$f":"Calculator!G223","v":""},{"$f":"Calculator!H223","v":""},{"$f":"Calculator!I223","v":""},{"$f":"Calculator!J223","v":""}]
[{"$f":"IFERROR(YEAR(Calculator!C224),\"\")","v":""},{"$f":"IFERROR(VLOOKUP(MONTH(Calculator!C224),'Month mapping'!A:B,2,0),\"\")","v":""},{"$f":"Calculator!D224","v":""},{"$f":"Calculator!E224","v":""},{"$f":"Calculator!G224","v":""},{"$f":"Calculator!H224","v":""},{"$f":"Calculator!I224","v":""},{"$f":"Calculator!J224","v":""}]
[{"$f":"IFERROR(YEAR(Calculator!C225),\"\")","v":""},{"$f":"IFERROR(VLOOKUP(MONTH(Calculator!C225),'Month mapping'!A:B,2,0),\"\")","v":""},{"$f":"Calculator!D225","v":""},{"$f":"Calculator!E225","v":""},{"$f":"Calculator!G225","v":""},{"$f":"Calculator!H225","v":""},{"$f":"Calculator!I225","v":""},{"$f":"Calculator!J225","v":""}]
[{"$f":"IFERROR(YEAR(Calculator!C226),\"\")","v":""},{"$f":"IFERROR(VLOOKUP(MONTH(Calculator!C226),'Month mapping'!A:B,2,0),\"\")","v":""},{"$f":"Calculator!D226","v":""},{"$f":"Calculator!E226","v":""},{"$f":"Calculator!G226","v":""},{"$f":"Calculator!H226","v":""},{"$f":"Calculator!I226","v":""},{"$f":"Calculator!J226","v":""}]
[{"$f":"IFERROR(YEAR(Calculator!C227),\"\")","v":""},{"$f":"IFERROR(VLOOKUP(MONTH(Calculator!C227),'Month mapping'!A:B,2,0),\"\")","v":""},{"$f":"Calculator!D227","v":""},{"$f":"Calculator!E227","v":""},{"$f":"Calculator!G227","v":""},{"$f":"Calculator!H227","v":""},{"$f":"Calculator!I227","v":""},{"$f":"Calculator!J227","v":""}]
[{"$f":"IFERROR(YEAR(Calculator!C228),\"\")","v":""},{"$f":"IFERROR(VLOOKUP(MONTH(Calculator!C228),'Month mapping'!A:B,2,0),\"\")","v":""},{"$f":"Calculator!D228","v":""},{"$f":"Calculator!E228","v":""},{"$f":"Calculator!G228","v":""},{"$f":"Calculator!H228","v":""},{"$f":"Calculator!I228","v":""},{"$f":"Calculator!J228","v":""}]
[{"$f":"IFERROR(YEAR(Calculator!C229),\"\")","v":""},{"$f":"IFERROR(VLOOKUP(MONTH(Calculator!C229),'Month mapping'!A:B,2,0),\"\")","v":""},{"$f":"Calculator!D229","v":""},{"$f":"Calculator!E229","v":""},{"$f":"Calculator!G229","v":""},{"$f":"Calculator!H229","v":""},{"$f":"Calculator!I229","v":""},{"$f":"Calculator!J229","v":""}]
[{"$f":"IFERROR(YEAR(Calculator!C230),\"\")","v":""},{"$f":"IFERROR(VLOOKUP(MONTH(Calculator!C230),'Month mapping'!A:B,2,0),\"\")","v":""},{"$f":"Calculator!D230","v":""},{"$f":"Calculator!E230","v":""},{"$f":"Calculator!G230","v":""},{"$f":"Calculator!H230","v":""},{"$f":"Calculator!I230","v":""},{"$f":"Calculator!J230","v":""}]
[{"$f":"IFERROR(YEAR(Calculator!C231),\"\")","v":""},{"$f":"IFERROR(VLOOKUP(MONTH(Calculator!C231),'Month mapping'!A:B,2,0),\"\")","v":""},{"$f":"Calculator!D231","v":""},{"$f":"Calculator!E231","v":""},{"$f":"Calculator!G231","v":""},{"$f":"Calculator!H231","v":""},{"$f":"Calculator!I231","v":""},{"$f":"Calculator!J231","v":""}]
[{"$f":"IFERROR(YEAR(Calculator!C232),\"\")","v":""},{"$f":"IFERROR(VLOOKUP(MONTH(Calculator!C232),'Month mapping'!A:B,2,0),\"\")","v":""},{"$f":"Calculator!D232","v":""},{"$f":"Calculator!E232","v":""},{"$f":"Calculator!G232","v":""},{"$f":"Calculator!H232","v":""},{"$f":"Calculator!I232","v":""},{"$f":"Calculator!J232","v":""}]
[{"$f":"IFERROR(YEAR(Calculator!C233),\"\")","v":""},{"$f":"IFERROR(VLOOKUP(MONTH(Calculator!C233),'Month mapping'!A:B,2,0),\"\")","v":""},{"$f":"Calculator!D233","v":""},{"$f":"Calculator!E233","v":""},{"$f":"Calculator!G233","v":""},{"$f":"Calculator!H233","v":""},{"$f":"Calculator!I233","v":""},{"$f":"Calculator!J233","v":""}]
[{"$f":"IFERROR(YEAR(Calculator!C234),\"\")","v":""},{"$f":"IFERROR(VLOOKUP(MONTH(Calculator!C234),'Month mapping'!A:B,2,0),\"\")","v":""},{"$f":"Calculator!D234","v":""},{"$f":"Calculator!E234","v":""},{"$f":"Calculator!G234","v":""},{"$f":"Calculator!H234","v":""},{"$f":"Calculator!I234","v":""},{"$f":"Calculator!J234","v":""}]
[{"$f":"IFERROR(YEAR(Calculator!C235),\"\")","v":""},{"$f":"IFERROR(VLOOKUP(MONTH(Calculator!C235),'Month mapping'!A:B,2,0),\"\")","v":""},{"$f":"Calculator!D235","v":""},{"$f":"Calculator!E235","v":""},{"$f":"Calculator!G235","v":""},{"$f":"Calculator!H235","v":""},{"$f":"Calculator!I235","v":""},{"$f":"Calculator!J235","v":""}]
[{"$f":"IFERROR(YEAR(Calculator!C236),\"\")","v":""},{"$f":"IFERROR(VLOOKUP(MONTH(Calculator!C236),'Month mapping'!A:B,2,0),\"\")","v":""},{"$f":"Calculator!D236","v":""},{"$f":"Calculator!E236","v":""},{"$f":"Calculator!G236","v":""},{"$f":"Calculator!H236","v":""},{"$f":"Calculator!I236","v":""},{"$f":"Calculator!J236","v":""}]
[{"$f":"IFERROR(YEAR(Calculator!C237),\"\")","v":""},{"$f":"IFERROR(VLOOKUP(MONTH(Calculator!C237),'Month mapping'!A:B,2,0),\"\")","v":""},{"$f":"Calculator!D237","v":""},{"$f":"Calculator!E237","v":""},{"$f":"Calculator!G237","v":""},{"$f":"Calculator!H237","v":""},{"$f":"Calculator!I237","v":""},{"$f":"Calculator!J237","v":""}]
[{"$f":"IFERROR(YEAR(Calculator!C238),\"\")","v":""},{"$f":"IFERROR(VLOOKUP(MONTH(Calculator!C238),'Month mapping'!A:B,2,0),\"\")","v":""},{"$f":"Calculator!D238","v":""},{"$f":"Calculator!E238","v":""},{"$f":"Calculator!G238","v":""},{"$f":"Calculator!H238","v":""},{"$f":"Calculator!I238","v":""},{"$f":"Calculator!J238","v":""}]
[{"$f":"IFERROR(YEAR(Calculator!C239),\"\")","v":""},{"$f":"IFERROR(VLOOKUP(MONTH(Calculator!C239),'Month mapping'!A:B,2,0),\"\")","v":""},{"$f":"Calculator!D239","v":""},{"$f":"Calculator!E239","v":""},{"$f":"Calculator!G239","v":""},{"$f":"Calculator!H239","v":""},{"$f":"Calculator!I239","v":""},{"$f":"Calculator!J239","v":""}]
[{"$f":"IFERROR(YEAR(Calculator!C240),\"\")","v":""},{"$f":"IFERROR(VLOOKUP(MONTH(Calculator!C240),'Month mapping'!A:B,2,0),\"\")","v":""},{"$f":"Calculator!D240","v":""},{"$f":"Calculator!E240","v":""},{"$f":"Calculator!G240","v":""},{"$f":"Calculator!H240","v":""},{"$f":"Calculator!I240","v":""},{"$f":"Calculator!J240","v":""}]
[{"$f":"IFERROR(YEAR(Calculator!C241),\"\")","v":""},{"$f":"IFERROR(VLOOKUP(MONTH(Calculator!C241),'Month mapping'!A:B,2,0),\"\")","v":""},{"$f":"Calculator!D241","v":""},{"$f":"Calculator!E241","v":""},{"$f":"Calculator!G241","v":""},{"$f":"Calculator!H241","v":""},{"$f":"Calculator!I241","v":""},{"$f":"Calculator!J241","v":""}]
[{"$f":"IFERROR(YEAR(Calculator!C242),\"\")","v":""},{"$f":"IFERROR(VLOOKUP(MONTH(Calculator!C242),'Month mapping'!A:B,2,0),\"\")","v":""},{"$f":"Calculator!D242","v":""},{"$f":"Calculator!E242","v":""},{"$f":"Calculator!G242","v":""},{"$f":"Calculator!H242","v":""},{"$f":"Calculator!I242","v":""},{"$f":"Calculator!J242","v":""}]
[{"$f":"IFERROR(YEAR(Calculator!C243),\"\")","v":""},{"$f":"IFERROR(VLOOKUP(MONTH(Calculator!C243),'Month mapping'!A:B,2,0),\"\")","v":""},{"$f":"Calculator!D243","v":""},{"$f":"Calculator!E243","v":""},{"$f":"Calculator!G243","v":""},{"$f":"Calculator!H243","v":""},{"$f":"Calculator!I243","v":""},{"$f":"Calculator!J243","v":""}]
[{"$f":"IFERROR(YEAR(Calculator!C244),\"\")","v":""},{"$f":"IFERROR(VLOOKUP(MONTH(Calculator!C244),'Month mapping'!A:B,2,0),\"\")","v":""},{"$f":"Calculator!D244","v":""},{"$f":"Calculator!E244","v":""},{"$f":"Calculator!G244","v":""},{"$f":"Calculator!H244","v":""},{"$f":"Calculator!I244","v":""},{"$f":"Calculator!J244","v":""}]
[{"$f":"IFERROR(YEAR(Calculator!C245),\"\")","v":""},{"$f":"IFERROR(VLOOKUP(MONTH(Calculator!C245),'Month mapping'!A:B,2,0),\"\")","v":""},{"$f":"Calculator!D245","v":""},{"$f":"Calculator!E245","v":""},{"$f":"Calculator!G245","v":""},{"$f":"Calculator!H245","v":""},{"$f":"Calculator!I245","v":""},{"$f":"Calculator!J245","v":""}]
[{"$f":"IFERROR(YEAR(Calculator!C246),\"\")","v":""},{"$f":"IFERROR(VLOOKUP(MONTH(Calculator!C246),'Month mapping'!A:B,2,0),\"\")","v":""},{"$f":"Calculator!D246","v":""},{"$f":"Calculator!E246","v":""},{"$f":"Calculator!G246","v":""},{"$f":"Calculator!H246","v":""},{"$f":"Calculator!I246","v":""},{"$f":"Calculator!J246","v":""}]
[{"$f":"IFERROR(YEAR(Calculator!C247),\"\")","v":""},{"$f":"IFERROR(VLOOKUP(MONTH(Calculator!C247),'Month mapping'!A:B,2,0),\"\")","v":""},{"$f":"Calculator!D247","v":""},{"$f":"Calculator!E247","v":""},{"$f":"Calculator!G247","v":""},{"$f":"Calculator!H247","v":""},{"$f":"Calculator!I247","v":""},{"$f":"Calculator!J247","v":""}]
[{"$f":"IFERROR(YEAR(Calculator!C248),\"\")","v":""},{"$f":"IFERROR(VLOOKUP(MONTH(Calculator!C248),'Month mapping'!A:B,2,0),\"\")","v":""},{"$f":"Calculator!D248","v":""},{"$f":"Calculator!E248","v":""},{"$f":"Calculator!G248","v":""},{"$f":"Calculator!H248","v":""},{"$f":"Calculator!I248","v":""},{"$f":"Calculator!J248","v":""}]
[{"$f":"IFERROR(YEAR(Calculator!C249),\"\")","v":""},{"$f":"IFERROR(VLOOKUP(MONTH(Calculator!C249),'Month mapping'!A:B,2,0),\"\")","v":""},{"$f":"Calculator!D249","v":""},{"$f":"Calculator!E249","v":""},{"$f":"Calculator!G249","v":""},{"$f":"Calculator!H249","v":""},{"$f":"Calculator!I249","v":""},{"$f":"Calculator!J249","v":""}]
[{"$f":"IFERROR(YEAR(Calculator!C250),\"\")","v":""},{"$f":"IFERROR(VLOOKUP(MONTH(Calculator!C250),'Month mapping'!A:B,2,0),\"\")","v":""},{"$f":"Calculator!D250","v":""},{"$f":"Calculator!E250","v":""},{"$f":"Calculator!G250","v":""},{"$f":"Calculator!H250","v":""},{"$f":"Calculator!I250","v":""},{"$f":"Calculator!J250","v":""}]
[{"$f":"IFERROR(YEAR(Calculator!C251),\"\")","v":""},{"$f":"IFERROR(VLOOKUP(MONTH(Calculator!C251),'Month mapping'!A:B,2,0),\"\")","v":""},{"$f":"Calculator!D251","v":""},{"$f":"Calculator!E251","v":""},{"$f":"Calculator!G251","v":""},{"$f":"Calculator!H251","v":""},{"$f":"Calculator!I251","v":""},{"$f":"Calculator!J251","v":""}]
[{"$f":"IFERROR(YEAR(Calculator!C252),\"\")","v":""},{"$f":"IFERROR(VLOOKUP(MONTH(Calculator!C252),'Month mapping'!A:B,2,0),\"\")","v":""},{"$f":"Calculator!D252","v":""},{"$f":"Calculator!E252","v":""},{"$f":"Calculator!G252","v":""},{"$f":"Calculator!H252","v":""},{"$f":"Calculator!I252","v":""},{"$f":"Calculator!J252","v":""}]
[{"$f":"IFERROR(YEAR(Calculator!C253),\"\")","v":""},{"$f":"IFERROR(VLOOKUP(MONTH(Calculator!C253),'Month mapping'!A:B,2,0),\"\")","v":""},{"$f":"Calculator!D253","v":""},{"$f":"Calculator!E253","v":""},{"$f":"Calculator!G253","v":""},{"$f":"Calculator!H253","v":""},{"$f":"Calculator!I253","v":""},{"$f":"Calculator!J253","v":""}]
[{"$f":"IFERROR(YEAR(Calculator!C254),\"\")","v":""},{"$f":"IFERROR(VLOOKUP(MONTH(Calculator!C254),'Month mapping'!A:B,2,0),\"\")","v":""},{"$f":"Calculator!D254","v":""},{"$f":"Calculator!E254","v":""},{"$f":"Calculator!G254","v":""},{"$f":"Calculator!H254","v":""},{"$f":"Calculator!I254","v":""},{"$f":"Calculator!J254","v":""}]
[{"$f":"IFERROR(YEAR(Calculator!C255),\"\")","v":""},{"$f":"IFERROR(VLOOKUP(MONTH(Calculator!C255),'Month mapping'!A:B,2,0),\"\")","v":""},{"$f":"Calculator!D255","v":""},{"$f":"Calculator!E255","v":""},{"$f":"Calculator!G255","v":""},{"$f":"Calculator!H255","v":""},{"$f":"Calculator!I255","v":""},{"$f":"Calculator!J255","v":""}]
[{"$f":"IFERROR(YEAR(Calculator!C256),\"\")","v":""},{"$f":"IFERROR(VLOOKUP(MONTH(Calculator!C256),'Month mapping'!A:B,2,0),\"\")","v":""},{"$f":"Calculator!D256","v":""},{"$f":"Calculator!E256","v":""},{"$f":"Calculator!G256","v":""},{"$f":"Calculator!H256","v":""},{"$f":"Calculator!I256","v":""},{"$f":"Calculator!J256","v":""}]
[{"$f":"IFERROR(YEAR(Calculator!C257),\"\")","v":""},{"$f":"IFERROR(VLOOKUP(MONTH(Calculator!C257),'Month mapping'!A:B,2,0),\"\")","v":""},{"$f":"Calculator!D257","v":""},{"$f":"Calculator!E257","v":""},{"$f":"Calculator!G257","v":""},{"$f":"Calculator!H257","v":""},{"$f":"Calculator!I257","v":""},{"$f":"Calculator!J257","v":""}]
[{"$f":"IFERROR(YEAR(Calculator!C258),\"\")","v":""},{"$f":"IFERROR(VLOOKUP(MONTH(Calculator!C258),'Month mapping'!A:B,2,0),\"\")","v":""},{"$f":"Calculator!D258","v":""},{"$f":"Calculator!E258","v":""},{"$f":"Calculator!G258","v":""},{"$f":"Calculator!H258","v":""},{"$f":"Calculator!I258","v":""},{"$f":"Calculator!J258","v":""}]
[{"$f":"IFERROR(YEAR(Calculator!C259),\"\")","v":""},{"$f":"IFERROR(VLOOKUP(MONTH(Calculator!C259),'Month mapping'!A:B,2,0),\"\")","v":""},{"$f":"Calculator!D259","v":""},{"$f":"Calculator!E259","v":""},{"$f":"Calculator!G259","v":""},{"$f":"Calculator!H259","v":""},{"$f":"Calculator!I259","v":""},{"$f":"Calculator!J259","v":""}]
[{"$f":"IFERROR(YEAR(Calculator!C260),\"\")","v":""},{"$f":"IFERROR(VLOOKUP(MONTH(Calculator!C260),'Month mapping'!A:B,2,0),\"\")","v":""},{"$f":"Calculator!D260","v":""},{"$f":"Calculator!E260","v":""},{"$f":"Calculator!G260","v":""},{"$f":"Calculator!H260","v":""},{"$f":"Calculator!I260","v":""},{"$f":"Calculator!J260","v":""}]
[{"$f":"IFERROR(YEAR(Calculator!C261),\"\")","v":""},{"$f":"IFERROR(VLOOKUP(MONTH(Calculator!C261),'Month mapping'!A:B,2,0),\"\")","v":""},{"$f":"Calculator!D261","v":""},{"$f":"Calculator!E261","v":""},{"$f":"Calculator!G261","v":""},{"$f":"Calculator!H261","v":""},{"$f":"Calculator!I261","v":""},{"$f":"Calculator!J261","v":""}]
[{"$f":"IFERROR(YEAR(Calculator!C262),\"\")","v":""},{"$f":"IFERROR(VLOOKUP(MONTH(Calculator!C262),'Month mapping'!A:B,2,0),\"\")","v":""},{"$f":"Calculator!D262","v":""},{"$f":"Calculator!E262","v":""},{"$f":"Calculator!G262","v":""},{"$f":"Calculator!H262","v":""},{"$f":"Calculator!I262","v":""},{"$f":"Calculator!J262","v":""}]
[{"$f":"IFERROR(YEAR(Calculator!C263),\"\")","v":""},{"$f":"IFERROR(VLOOKUP(MONTH(Calculator!C263),'Month mapping'!A:B,2,0),\"\")","v":""},{"$f":"Calculator!D263","v":""},{"$f":"Calculator!E263","v":""},{"$f":"Calculator!G263","v":""},{"$f":"Calculator!H263","v":""},{"$f":"Calculator!I263","v":""},{"$f":"Calculator!J263","v":""}]
[{"$f":"IFERROR(YEAR(Calculator!C264),\"\")","v":""},{"$f":"IFERROR(VLOOKUP(MONTH(Calculator!C264),'Month mapping'!A:B,2,0),\"\")","v":""},{"$f":"Calculator!D264","v":""},{"$f":"Calculator!E264","v":""},{"$f":"Calculator!G264","v":""},{"$f":"Calculator!H264","v":""},{"$f":"Calculator!I264","v":""},{"$f":"Calculator!J264","v":""}]
[{"$f":"IFERROR(YEAR(Calculator!C265),\"\")","v":""},{"$f":"IFERROR(VLOOKUP(MONTH(Calculator!C265),'Month mapping'!A:B,2,0),\"\")","v":""},{"$f":"Calculator!D265","v":""},{"$f":"Calculator!E265","v":""},{"$f":"Calculator!G265","v":""},{"$f":"Calculator!H265","v":""},{"$f":"Calculator!I265","v":""},{"$f":"Calculator!J265","v":""}]
[{"$f":"IFERROR(YEAR(Calculator!C266),\"\")","v":""},{"$f":"IFERROR(VLOOKUP(MONTH(Calculator!C266),'Month mapping'!A:B,2,0),\"\")","v":""},{"$f":"Calculator!D266","v":""},{"$f":"Calculator!E266","v":""},{"$f":"Calculator!G266","v":""},{"$f":"Calculator!H266","v":""},{"$f":"Calculator!I266","v":""},{"$f":"Calculator!J266","v":""}]
[{"$f":"IFERROR(YEAR(Calculator!C267),\"\")","v":""},{"$f":"IFERROR(VLOOKUP(MONTH(Calculator!C267),'Month mapping'!A:B,2,0),\"\")","v":""},{"$f":"Calculator!D267","v":""},{"$f":"Calculator!E267","v":""},{"$f":"Calculator!G267","v":""},{"$f":"Calculator!H267","v":""},{"$f":"Calculator!I267","v":""},{"$f":"Calculator!J267","v":""}]
[{"$f":"IFERROR(YEAR(Calculator!C268),\"\")","v":""},{"$f":"IFERROR(VLOOKUP(MONTH(Calculator!C268),'Month mapping'!A:B,2,0),\"\")","v":""},{"$f":"Calculator!D268","v":""},{"$f":"Calculator!E268","v":""},{"$f":"Calculator!G268","v":""},{"$f":"Calculator!H268","v":""},{"$f":"Calculator!I268","v":""},{"$f":"Calculator!J268","v":""}]
[{"$f":"IFERROR(YEAR(Calculator!C269),\"\")","v":""},{"$f":"IFERROR(VLOOKUP(MONTH(Calculator!C269),'Month mapping'!A:B,2,0),\"\")","v":""},{"$f":"Calculator!D269","v":""},{"$f":"Calculator!E269","v":""},{"$f":"Calculator!G269","v":""},{"$f":"Calculator!H269","v":""},{"$f":"Calculator!I269","v":""},{"$f":"Calculator!J269","v":""}]
[{"$f":"IFERROR(YEAR(Calculator!C270),\"\")","v":""},{"$f":"IFERROR(VLOOKUP(MONTH(Calculator!C270),'Month mapping'!A:B,2,0),\"\")","v":""},{"$f":"Calculator!D270","v":""},{"$f":"Calculator!E270","v":""},{"$f":"Calculator!G270","v":""},{"$f":"Calculator!H270","v":""},{"$f":"Calculator!I270","v":""},{"$f":"Calculator!J270","v":""}]
[{"$f":"IFERROR(YEAR(Calculator!C271),\"\")","v":""},{"$f":"IFERROR(VLOOKUP(MONTH(Calculator!C271),'Month mapping'!A:B,2,0),\"\")","v":""},{"$f":"Calculator!D271","v":""},{"$f":"Calculator!E271","v":""},{"$f":"Calculator!G271","v":""},{"$f":"Calculator!H271","v":""},{"$f":"Calculator!I271","v":""},{"$f":"Calculator!J271","v":""}]
[{"$f":"IFERROR(YEAR(Calculator!C272),\"\")","v":""},{"$f":"IFERROR(VLOOKUP(MONTH(Calculator!C272),'Month mapping'!A:B,2,0),\"\")","v":""},{"$f":"Calculator!D272","v":""},{"$f":"Calculator!E272","v":""},{"$f":"Calculator!G272","v":""},{"$f":"Calculator!H272","v":""},{"$f":"Calculator!I272","v":""},{"$f":"Calculator!J272","v":""}]
[{"$f":"IFERROR(YEAR(Calculator!C273),\"\")","v":""},{"$f":"IFERROR(VLOOKUP(MONTH(Calculator!C273),'Month mapping'!A:B,2,0),\"\")","v":""},{"$f":"Calculator!D273","v":""},{"$f":"Calculator!E273","v":""},{"$f":"Calculator!G273","v":""},{"$f":"Calculator!H273","v":""},{"$f":"Calculator!I273","v":""},{"$f":"Calculator!J273","v":""}]
[{"$f":"IFERROR(YEAR(Calculator!C274),\"\")","v":""},{"$f":"IFERROR(VLOOKUP(MONTH(Calculator!C274),'Month mapping'!A:B,2,0),\"\")","v":""},{"$f":"Calculator!D274","v":""},{"$f":"Calculator!E274","v":""},{"$f":"Calculator!G274","v":""},{"$f":"Calculator!H274","v":""},{"$f":"Calculator!I274","v":""},{"$f":"Calculator!J274","v":""}]
[{"$f":"IFERROR(YEAR(Calculator!C275),\"\")","v":""},{"$f":"IFERROR(VLOOKUP(MONTH(Calculator!C275),'Month mapping'!A:B,2,0),\"\")","v":""},{"$f":"Calculator!D275","v":""},{"$f":"Calculator!E275","v":""},{"$f":"Calculator!G275","v":""},{"$f":"Calculator!H275","v":""},{"$f":"Calculator!I275","v":""},{"$f":"Calculator!J275","v":""}]
[{"$f":"IFERROR(YEAR(Calculator!C276),\"\")","v":""},{"$f":"IFERROR(VLOOKUP(MONTH(Calculator!C276),'Month mapping'!A:B,2,0),\"\")","v":""},{"$f":"Calculator!D276","v":""},{"$f":"Calculator!E276","v":""},{"$f":"Calculator!G276","v":""},{"$f":"Calculator!H276","v":""},{"$f":"Calculator!I276","v":""},{"$f":"Calculator!J276","v":""}]
[{"$f":"IFERROR(YEAR(Calculator!C277),\"\")","v":""},{"$f":"IFERROR(VLOOKUP(MONTH(Calculator!C277),'Month mapping'!A:B,2,0),\"\")","v":""},{"$f":"Calculator!D277","v":""},{"$f":"Calculator!E277","v":""},{"$f":"Calculator!G277","v":""},{"$f":"Calculator!H277","v":""},{"$f":"Calculator!I277","v":""},{"$f":"Calculator!J277","v":""}]
[{"$f":"IFERROR(YEAR(Calculator!C278),\"\")","v":""},{"$f":"IFERROR(VLOOKUP(MONTH(Calculator!C278),'Month mapping'!A:B,2,0),\"\")","v":""},{"$f":"Calculator!D278","v":""},{"$f":"Calculator!E278","v":""},{"$f":"Calculator!G278","v":""},{"$f":"Calculator!H278","v":""},{"$f":"Calculator!I278","v":""},{"$f":"Calculator!J278","v":""}]
[{"$f":"IFERROR(YEAR(Calculator!C279),\"\")","v":""},{"$f":"IFERROR(VLOOKUP(MONTH(Calculator!C279),'Month mapping'!A:B,2,0),\"\")","v":""},{"$f":"Calculator!D279","v":""},{"$f":"Calculator!E279","v":""},{"$f":"Calculator!G279","v":""},{"$f":"Calculator!H279","v":""},{"$f":"Calculator!I279","v":""},{"$f":"Calculator!J279","v":""}]
[{"$f":"IFERROR(YEAR(Calculator!C280),\"\")","v":""},{"$f":"IFERROR(VLOOKUP(MONTH(Calculator!C280),'Month mapping'!A:B,2,0),\"\")","v":""},{"$f":"Calculator!D280","v":""},{"$f":"Calculator!E280","v":""},{"$f":"Calculator!G280","v":""},{"$f":"Calculator!H280","v":""},{"$f":"Calculator!I280","v":""},{"$f":"Calculator!J280","v":""}]
[{"$f":"IFERROR(YEAR(Calculator!C281),\"\")","v":""},{"$f":"IFERROR(VLOOKUP(MONTH(Calculator!C281),'Month mapping'!A:B,2,0),\"\")","v":""},{"$f":"Calculator!D281","v":""},{"$f":"Calculator!E281","v":""},{"$f":"Calculator!G281","v":""},{"$f":"Calculator!H281","v":""},{"$f":"Calculator!I281","v":""},{"$f":"Calculator!J281","v":""}]
[{"$f":"IFERROR(YEAR(Calculator!C282),\"\")","v":""},{"$f":"IFERROR(VLOOKUP(MONTH(Calculator!C282),'Month mapping'!A:B,2,0),\"\")","v":""},{"$f":"Calculator!D282","v":""},{"$f":"Calculator!E282","v":""},{"$f":"Calculator!G282","v":""},{"$f":"Calculator!H282","v":""},{"$f":"Calculator!I282","v":""},{"$f":"Calculator!J282","v":""}]
[{"$f":"IFERROR(YEAR(Calculator!C283),\"\")","v":""},{"$f":"IFERROR(VLOOKUP(MONTH(Calculator!C283),'Month mapping'!A:B,2,0),\"\")","v":""},{"$f":"Calculator!D283","v":""},{"$f":"Calculator!E283","v":""},{"$f":"Calculator!G283","v":""},{"$f":"Calculator!H283","v":""},{"$f":"Calculator!I283","v":""},{"$f":"Calculator!J283","v":""}]
[{"$f":"IFERROR(YEAR(Calculator!C284),\"\")","v":""},{"$f":"IFERROR(VLOOKUP(MONTH(Calculator!C284),'Month mapping'!A:B,2,0),\"\")","v":""},{"$f":"Calculator!D284","v":""},{"$f":"Calculator!E284","v":""},{"$f":"Calculator!G284","v":""},{"$f":"Calculator!H284","v":""},{"$f":"Calculator!I284","v":""},{"$f":"Calculator!J284","v":""}]
[{"$f":"IFERROR(YEAR(Calculator!C285),\"\")","v":""},{"$f":"IFERROR(VLOOKUP(MONTH(Calculator!C285),'Month mapping'!A:B,2,0),\"\")","v":""},{"$f":"Calculator!D285","v":""},{"$f":"Calculator!E285","v":""},{"$f":"Calculator!G285","v":""},{"$f":"Calculator!H285","v":""},{"$f":"Calculator!I285","v":""},{"$f":"Calculator!J285","v":""}]
[{"$f":"IFERROR(YEAR(Calculator!C286),\"\")","v":""},{"$f":"IFERROR(VLOOKUP(MONTH(Calculator!C286),'Month mapping'!A:B,2,0),\"\")","v":""},{"$f":"Calculator!D286","v":""},{"$f":"Calculator!E286","v":""},{"$f":"Calculator!G286","v":""},{"$f":"Calculator!H286","v":""},{"$f":"Calculator!I286","v":""},{"$f":"Calculator!J286","v":""}]
[{"$f":"IFERROR(YEAR(Calculator!C287),\"\")","v":""},{"$f":"IFERROR(VLOOKUP(MONTH(Calculator!C287),'Month mapping'!A:B,2,0),\"\")","v":""},{"$f":"Calculator!D287","v":""},{"$f":"Calculator!E287","v":""},{"$f":"Calculator!G287","v":""},{"$f":"Calculator!H287","v":""},{"$f":"Calculator!I287","v":""},{"$f":"Calculator!J287","v":""}]
[{"$f":"IFERROR(YEAR(Calculator!C288),\"\")","v":""},{"$f":"IFERROR(VLOOKUP(MONTH(Calculator!C288),'Month mapping'!A:B,2,0),\"\")","v":""},{"$f":"Calculator!D288","v":""},{"$f":"Calculator!E288","v":""},{"$f":"Calculator!G288","v":""},{"$f":"Calculator!H288","v":""},{"$f":"Calculator!I288","v":""},{"$f":"Calculator!J288","v":""}]
[{"$f":"IFERROR(YEAR(Calculator!C289),\"\")","v":""},{"$f":"IFERROR(VLOOKUP(MONTH(Calculator!C289),'Month mapping'!A:B,2,0),\"\")","v":""},{"$f":"Calculator!D289","v":""},{"$f":"Calculator!E289","v":""},{"$f":"Calculator!G289","v":""},{"$f":"Calculator!H289","v":""},{"$f":"Calculator!I289","v":""},{"$f":"Calculator!J289","v":""}]
[{"$f":"IFERROR(YEAR(Calculator!C290),\"\")","v":""},{"$f":"IFERROR(VLOOKUP(MONTH(Calculator!C290),'Month mapping'!A:B,2,0),\"\")","v":""},{"$f":"Calculator!D290","v":""},{"$f":"Calculator!E290","v":""},{"$f":"Calculator!G290","v":""},{"$f":"Calculator!H290","v":""},{"$f":"Calculator!I290","v":""},{"$f":"Calculator!J290","v":""}]
[{"$f":"IFERROR(YEAR(Calculator!C291),\"\")","v":""},{"$f":"IFERROR(VLOOKUP(MONTH(Calculator!C291),'Month mapping'!A:B,2,0),\"\")","v":""},{"$f":"Calculator!D291","v":""},{"$f":"Calculator!E291","v":""},{"$f":"Calculator!G291","v":""},{"$f":"Calculator!H291","v":""},{"$f":"Calculator!I291","v":""},{"$f":"Calculator!J291","v":""}]
[{"$f":"IFERROR(YEAR(Calculator!C292),\"\")","v":""},{"$f":"IFERROR(VLOOKUP(MONTH(Calculator!C292),'Month mapping'!A:B,2,0),\"\")","v":""},{"$f":"Calculator!D292","v":""},{"$f":"Calculator!E292","v":""},{"$f":"Calculator!G292","v":""},{"$f":"Calculator!H292","v":""},{"$f":"Calculator!I292","v":""},{"$f":"Calculator!J292","v":""}]
[{"$f":"IFERROR(YEAR(Calculator!C293),\"\")","v":""},{"$f":"IFERROR(VLOOKUP(MONTH(Calculator!C293),'Month mapping'!A:B,2,0),\"\")","v":""},{"$f":"Calculator!D293","v":""},{"$f":"Calculator!E293","v":""},{"$f":"Calculator!G293","v":""},{"$f":"Calculator!H293","v":""},{"$f":"Calculator!I293","v":""},{"$f":"Calculator!J293","v":""}]
[{"$f":"IFERROR(YEAR(Calculator!C294),\"\")","v":""},{"$f":"IFERROR(VLOOKUP(MONTH(Calculator!C294),'Month mapping'!A:B,2,0),\"\")","v":""},{"$f":"Calculator!D294","v":""},{"$f":"Calculator!E294","v":""},{"$f":"Calculator!G294","v":""},{"$f":"Calculator!H294","v":""},{"$f":"Calculator!I294","v":""},{"$f":"Calculator!J294","v":""}]
[{"$f":"IFERROR(YEAR(Calculator!C295),\"\")","v":""},{"$f":"IFERROR(VLOOKUP(MONTH(Calculator!C295),'Month mapping'!A:B,2,0),\"\")","v":""},{"$f":"Calculator!D295","v":""},{"$f":"Calculator!E295","v":""},{"$f":"Calculator!G295","v":""},{"$f":"Calculator!H295","v":""},{"$f":"Calculator!I295","v":""},{"$f":"Calculator!J295","v":""}]
[{"$f":"IFERROR(YEAR(Calculator!C296),\"\")","v":""},{"$f":"IFERROR(VLOOKUP(MONTH(Calculator!C296),'Month mapping'!A:B,2,0),\"\")","v":""},{"$f":"Calculator!D296","v":""},{"$f":"Calculator!E296","v":""},{"$f":"Calculator!G296","v":""},{"$f":"Calculator!H296","v":""},{"$f":"Calculator!I296","v":""},{"$f":"Calculator!J296","v":""}]
[{"$f":"IFERROR(YEAR(Calculator!C297),\"\")","v":""},{"$f":"IFERROR(VLOOKUP(MONTH(Calculator!C297),'Month mapping'!A:B,2,0),\"\")","v":""},{"$f":"Calculator!D297","v":""},{"$f":"Calculator!E297","v":""},{"$f":"Calculator!G297","v":""},{"$f":"Calculator!H297","v":""},{"$f":"Calculator!I297","v":""},{"$f":"Calculator!J297","v":""}]
[{"$f":"IFERROR(YEAR(Calculator!C298),\"\")","v":""},{"$f":"IFERROR(VLOOKUP(MONTH(Calculator!C298),'Month mapping'!A:B,2,0),\"\")","v":""},{"$f":"Calculator!D298","v":""},{"$f":"Calculator!E298","v":""},{"$f":"Calculator!G298","v":""},{"$f":"Calculator!H298","v":""},{"$f":"Calculator!I298","v":""},{"$f":"Calculator!J298","v":""}]
[{"$f":"IFERROR(YEAR(Calculator!C299),\"\")","v":""},{"$f":"IFERROR(VLOOKUP(MONTH(Calculator!C299),'Month mapping'!A:B,2,0),\"\")","v":""},{"$f":"Calculator!D299","v":""},{"$f":"Calculator!E299","v":""},{"$f":"Calculator!G299","v":""},{"$f":"Calculator!H299","v":""},{"$f":"Calculator!I299","v":""},{"$f":"Calculator!J299","v":""}]
[{"$f":"IFERROR(YEAR(Calculator!C300),\"\")","v":""},{"$f":"IFERROR(VLOOKUP(MONTH(Calculator!C300),'Month mapping'!A:B,2,0),\"\")","v":""},{"$f":"Calculator!D300","v":""},{"$f":"Calculator!E300","v":""},{"$f":"Calculator!G300","v":""},{"$f":"Calculator!H300","v":""},{"$f":"Calculator!I300","v":""},{"$f":"Calculator!J300","v":""}]
[{"$f":"IFERROR(YEAR(Calculator!C301),\"\")","v":""},{"$f":"IFERROR(VLOOKUP(MONTH(Calculator!C301),'Month mapping'!A:B,2,0),\"\")","v":""},{"$f":"Calculator!D301","v":""},{"$f":"Calculator!E301","v":""},{"$f":"Calculator!G301","v":""},{"$f":"Calculator!H301","v":""},{"$f":"Calculator!I301","v":""},{"$f":"Calculator!J301","v":""}]
[{"$f":"IFERROR(YEAR(Calculator!C302),\"\")","v":""},{"$f":"IFERROR(VLOOKUP(MONTH(Calculator!C302),'Month mapping'!A:B,2,0),\"\")","v":""},{"$f":"Calculator!D302","v":""},{"$f":"Calculator!E302","v":""},{"$f":"Calculator!G302","v":""},{"$f":"Calculator!H302","v":""},{"$f":"Calculator!I302","v":""},{"$f":"Calculator!J302","v":""}]
[{"$f":"IFERROR(YEAR(Calculator!C303),\"\")","v":""},{"$f":"IFERROR(VLOOKUP(MONTH(Calculator!C303),'Month mapping'!A:B,2,0),\"\")","v":""},{"$f":"Calculator!D303","v":""},{"$f":"Calculator!E303","v":""},{"$f":"Calculator!G303","v":""},{"$f":"Calculator!H303","v":""},{"$f":"Calculator!I303","v":""},{"$f":"Calculator!J303","v":""}]
[{"$f":"IFERROR(YEAR(Calculator!C304),\"\")","v":""},{"$f":"IFERROR(VLOOKUP(MONTH(Calculator!C304),'Month mapping'!A:B,2,0),\"\")","v":""},{"$f":"Calculator!D304","v":""},{"$f":"Calculator!E304","v":""},{"$f":"Calculator!G304","v":""},{"$f":"Calculator!H304","v":""},{"$f":"Calculator!I304","v":""},{"$f":"Calculator!J304","v":""}]
[{"$f":"IFERROR(YEAR(Calculator!C305),\"\")","v":""},{"$f":"IFERROR(VLOOKUP(MONTH(Calculator!C305),'Month mapping'!A:B,2,0),\"\")","v":""},{"$f":"Calculator!D305","v":""},{"$f":"Calculator!E305","v":""},{"$f":"Calculator!G305","v":""},{"$f":"Calculator!H305","v":""},{"$f":"Calculator!I305","v":""},{"$f":"Calculator!J305","v":""}]
[{"$f":"IFERROR(YEAR(Calculator!C306),\"\")","v":""},{"$f":"IFERROR(VLOOKUP(MONTH(Calculator!C306),'Month mapping'!A:B,2,0),\"\")","v":""},{"$f":"Calculator!D306","v":""},{"$f":"Calculator!E306","v":""},{"$f":"Calculator!G306","v":""},{"$f":"Calculator!H306","v":""},{"$f":"Calculator!I306","v":""},{"$f":"Calculator!J306","v":""}]
[{"$f":"IFERROR(YEAR(Calculator!C307),\"\")","v":""},{"$f":"IFERROR(VLOOKUP(MONTH(Calculator!C307),'Month mapping'!A:B,2,0),\"\")","v":""},{"$f":"Calculator!D307","v":""},{"$f":"Calculator!E307","v":""},{"$f":"Calculator!G307","v":""},{"$f":"Calculator!H307","v":""},{"$f":"Calculator!I307","v":""},{"$f":"Calculator!J307","v":""}]
[{"$f":"IFERROR(YEAR(Calculator!C308),\"\")","v":""},{"$f":"IFERROR(VLOOKUP(MONTH(Calculator!C308),'Month mapping'!A:B,2,0),\"\")","v":""},{"$f":"Calculator!D308","v":""},{"$f":"Calculator!E308","v":""},{"$f":"Calculator!G308","v":""},{"$f":"Calculator!H308","v":""},{"$f":"Calculator!I308","v":""},{"$f":"Calculator!J308","v":""}]
[{"$f":"IFERROR(YEAR(Calculator!C309),\"\")","v":""},{"$f":"IFERROR(VLOOKUP(MONTH(Calculator!C309),'Month mapping'!A:B,2,0),\"\")","v":""},{"$f":"Calculator!D309","v":""},{"$f":"Calculator!E309","v":""},{"$f":"Calculator!G309","v":""},{"$f":"Calculator!H309","v":""},{"$f":"Calculator!I309","v":""},{"$f":"Calculator!J309","v":""}]
[{"$f":"IFERROR(YEAR(Calculator!C310),\"\")","v":""},{"$f":"IFERROR(VLOOKUP(MONTH(Calculator!C310),'Month mapping'!A:B,2,0),\"\")","v":""},{"$f":"Calculator!D310","v":""},{"$f":"Calculator!E310","v":""},{"$f":"Calculator!G310","v":""},{"$f":"Calculator!H310","v":""},{"$f":"Calculator!I310","v":""},{"$f":"Calculator!J310","v":""}]
[{"$f":"IFERROR(YEAR(Calculator!C311),\"\")","v":""},{"$f":"IFERROR(VLOOKUP(MONTH(Calculator!C311),'Month mapping'!A:B,2,0),\"\")","v":""},{"$f":"Calculator!D311","v":""},{"$f":"Calculator!E311","v":""},{"$f":"Calculator!G311","v":""},{"$f":"Calculator!H311","v":""},{"$f":"Calculator!I311","v":""},{"$f":"Calculator!J311","v":""}]
[{"$f":"IFERROR(YEAR(Calculator!C312),\"\")","v":""},{"$f":"IFERROR(VLOOKUP(MONTH(Calculator!C312),'Month mapping'!A:B,2,0),\"\")","v":""},{"$f":"Calculator!D312","v":""},{"$f":"Calculator!E312","v":""},{"$f":"Calculator!G312","v":""},{"$f":"Calculator!H312","v":""},{"$f":"Calculator!I312","v":""},{"$f":"Calculator!J312","v":""}]
[{"$f":"IFERROR(YEAR(Calculator!C313),\"\")","v":""},{"$f":"IFERROR(VLOOKUP(MONTH(Calculator!C313),'Month mapping'!A:B,2,0),\"\")","v":""},{"$f":"Calculator!D313","v":""},{"$f":"Calculator!E313","v":""},{"$f":"Calculator!G313","v":""},{"$f":"Calculator!H313","v":""},{"$f":"Calculator!I313","v":""},{"$f":"Calculator!J313","v":""}]
[{"$f":"IFERROR(YEAR(Calculator!C314),\"\")","v":""},{"$f":"IFERROR(VLOOKUP(MONTH(Calculator!C314),'Month mapping'!A:B,2,0),\"\")","v":""},{"$f":"Calculator!D314","v":""},{"$f":"Calculator!E314","v":""},{"$f":"Calculator!G314","v":""},{"$f":"Calculator!H314","v":""},{"$f":"Calculator!I314","v":""},{"$f":"Calculator!J314","v":""}]
[{"$f":"IFERROR(YEAR(Calculator!C315),\"\")","v":""},{"$f":"IFERROR(VLOOKUP(MONTH(Calculator!C315),'Month mapping'!A:B,2,0),\"\")","v":""},{"$f":"Calculator!D315","v":""},{"$f":"Calculator!E315","v":""},{"$f":"Calculator!G315","v":""},{"$f":"Calculator!H315","v":""},{"$f":"Calculator!I315","v":""},{"$f":"Calculator!J315","v":""}]
[{"$f":"IFERROR(YEAR(Calculator!C316),\"\")","v":""},{"$f":"IFERROR(VLOOKUP(MONTH(Calculator!C316),'Month mapping'!A:B,2,0),\"\")","v":""},{"$f":"Calculator!D316","v":""},{"$f":"Calculator!E316","v":""},{"$f":"Calculator!G316","v":""},{"$f":"Calculator!H316","v":""},{"$f":"Calculator!I316","v":""},{"$f":"Calculator!J316","v":""}]
[{"$f":"IFERROR(YEAR(Calculator!C317),\"\")","v":""},{"$f":"IFERROR(VLOOKUP(MONTH(Calculator!C317),'Month mapping'!A:B,2,0),\"\")","v":""},{"$f":"Calculator!D317","v":""},{"$f":"Calculator!E317","v":""},{"$f":"Calculator!G317","v":""},{"$f":"Calculator!H317","v":""},{"$f":"Calculator!I317","v":""},{"$f":"Calculator!J317","v":""}]
[{"$f":"IFERROR(YEAR(Calculator!C318),\"\")","v":""},{"$f":"IFERROR(VLOOKUP(MONTH(Calculator!C318),'Month mapping'!A:B,2,0),\"\")","v":""},{"$f":"Calculator!D318","v":""},{"$f":"Calculator!E318","v":""},{"$f":"Calculator!G318","v":""},{"$f":"Calculator!H318","v":""},{"$f":"Calculator!I318","v":""},{"$f":"Calculator!J318","v":""}]
[{"$f":"IFERROR(YEAR(Calculator!C319),\"\")","v":""},{"$f":"IFERROR(VLOOKUP(MONTH(Calculator!C319),'Month mapping'!A:B,2,0),\"\")","v":""},{"$f":"Calculator!D319","v":""},{"$f":"Calculator!E319","v":""},{"$f":"Calculator!G319","v":""},{"$f":"Calculator!H319","v":""},{"$f":"Calculator!I319","v":""},{"$f":"Calculator!J319","v":""}]
[{"$f":"IFERROR(YEAR(Calculator!C320),\"\")","v":""},{"$f":"IFERROR(VLOOKUP(MONTH(Calculator!C320),'Month mapping'!A:B,2,0),\"\")","v":""},{"$f":"Calculator!D320","v":""},{"$f":"Calculator!E320","v":""},{"$f":"Calculator!G320","v":""},{"$f":"Calculator!H320","v":""},{"$f":"Calculator!I320","v":""},{"$f":"Calculator!J320","v":""}]
[{"$f":"IFERROR(YEAR(Calculator!C321),\"\")","v":""},{"$f":"IFERROR(VLOOKUP(MONTH(Calculator!C321),'Month mapping'!A:B,2,0),\"\")","v":""},{"$f":"Calculator!D321","v":""},{"$f":"Calculator!E321","v":""},{"$f":"Calculator!G321","v":""},{"$f":"Calculator!H321","v":""},{"$f":"Calculator!I321","v":""},{"$f":"Calculator!J321","v":""}]
[{"$f":"IFERROR(YEAR(Calculator!C322),\"\")","v":""},{"$f":"IFERROR(VLOOKUP(MONTH(Calculator!C322),'Month mapping'!A:B,2,0),\"\")","v":""},{"$f":"Calculator!D322","v":""},{"$f":"Calculator!E322","v":""},{"$f":"Calculator!G322","v":""},{"$f":"Calculator!H322","v":""},{"$f":"Calculator!I322","v":""},{"$f":"Calculator!J322","v":""}]
[{"$f":"IFERROR(YEAR(Calculator!C323),\"\")","v":""},{"$f":"IFERROR(VLOOKUP(MONTH(Calculator!C323),'Month mapping'!A:B,2,0),\"\")","v":""},{"$f":"Calculator!D323","v":""},{"$f":"Calculator!E323","v":""},{"$f":"Calculator!G323","v":""},{"$f":"Calculator!H323","v":""},{"$f":"Calculator!I323","v":""},{"$f":"Calculator!J323","v":""}]
[{"$f":"IFERROR(YEAR(Calculator!C324),\"\")","v":""},{"$f":"IFERROR(VLOOKUP(MONTH(Calculator!C324),'Month mapping'!A:B,2,0),\"\")","v":""},{"$f":"Calculator!D324","v":""},{"$f":"Calculator!E324","v":""},{"$f":"Calculator!G324","v":""},{"$f":"Calculator!H324","v":""},{"$f":"Calculator!I324","v":""},{"$f":"Calculator!J324","v":""}]
[{"$f":"IFERROR(YEAR(Calculator!C325),\"\")","v":""},{"$f":"IFERROR(VLOOKUP(MONTH(Calculator!C325),'Month mapping'!A:B,2,0),\"\")","v":""},{"$f":"Calculator!D325","v":""},{"$f":"Calculator!E325","v":""},{"$f":"Calculator!G325","v":""},{"$f":"Calculator!H325","v":""},{"$f":"Calculator!I325","v":""},{"$f":"Calculator!J325","v":""}]
[{"$f":"IFERROR(YEAR(Calculator!C326),\"\")","v":""},{"$f":"IFERROR(VLOOKUP(MONTH(Calculator!C326),'Month mapping'!A:B,2,0),\"\")","v":""},{"$f":"Calculator!D326","v":""},{"$f":"Calculator!E326","v":""},{"$f":"Calculator!G326","v":""},{"$f":"Calculator!H326","v":""},{"$f":"Calculator!I326","v":""},{"$f":"Calculator!J326","v":""}]
[{"$f":"IFERROR(YEAR(Calculator!C327),\"\")","v":""},{"$f":"IFERROR(VLOOKUP(MONTH(Calculator!C327),'Month mapping'!A:B,2,0),\"\")","v":""},{"$f":"Calculator!D327","v":""},{"$f":"Calculator!E327","v":""},{"$f":"Calculator!G327","v":""},{"$f":"Calculator!H327","v":""},{"$f":"Calculator!I327","v":""},{"$f":"Calculator!J327","v":""}]
[{"$f":"IFERROR(YEAR(Calculator!C328),\"\")","v":""},{"$f":"IFERROR(VLOOKUP(MONTH(Calculator!C328),'Month mapping'!A:B,2,0),\"\")","v":""},{"$f":"Calculator!D328","v":""},{"$f":"Calculator!E328","v":""},{"$f":"Calculator!G328","v":""},{"$f":"Calculator!H328","v":""},{"$f":"Calculator!I328","v":""},{"$f":"Calculator!J328","v":""}]
[{"$f":"IFERROR(YEAR(Calculator!C329),\"\")","v":""},{"$f":"IFERROR(VLOOKUP(MONTH(Calculator!C329),'Month mapping'!A:B,2,0),\"\")","v":""},{"$f":"Calculator!D329","v":""},{"$f":"Calculator!E329","v":""},{"$f":"Calculator!G329","v":""},{"$f":"Calculator!H329","v":""},{"$f":"Calculator!I329","v":""},{"$f":"Calculator!J329","v":""}]
[{"$f":"IFERROR(YEAR(Calculator!C330),\"\")","v":""},{"$f":"IFERROR(VLOOKUP(MONTH(Calculator!C330),'Month mapping'!A:B,2,0),\"\")","v":""},{"$f":"Calculator!D330","v":""},{"$f":"Calculator!E330","v":""},{"$f":"Calculator!G330","v":""},{"$f":"Calculator!H330","v":""},{"$f":"Calculator!I330","v":""},{"$f":"Calculator!J330","v":""}]
[{"$f":"IFERROR(YEAR(Calculator!C331),\"\")","v":""},{"$f":"IFERROR(VLOOKUP(MONTH(Calculator!C331),'Month mapping'!A:B,2,0),\"\")","v":""},{"$f":"Calculator!D331","v":""},{"$f":"Calculator!E331","v":""},{"$f":"Calculator!G331","v":""},{"$f":"Calculator!H331","v":""},{"$f":"Calculator!I331","v":""},{"$f":"Calculator!J331","v":""}]
[{"$f":"IFERROR(YEAR(Calculator!C332),\"\")","v":""},{"$f":"IFERROR(VLOOKUP(MONTH(Calculator!C332),'Month mapping'!A:B,2,0),\"\")","v":""},{"$f":"Calculator!D332","v":""},{"$f":"Calculator!E332","v":""},{"$f":"Calculator!G332","v":""},{"$f":"Calculator!H332","v":""},{"$f":"Calculator!I332","v":""},{"$f":"Calculator!J332","v":""}]
[{"$f":"IFERROR(YEAR(Calculator!C333),\"\")","v":""},{"$f":"IFERROR(VLOOKUP(MONTH(Calculator!C333),'Month mapping'!A:B,2,0),\"\")","v":""},{"$f":"Calculator!D333","v":""},{"$f":"Calculator!E333","v":""},{"$f":"Calculator!G333","v":""},{"$f":"Calculator!H333","v":""},{"$f":"Calculator!I333","v":""},{"$f":"Calculator!J333","v":""}]
[{"$f":"IFERROR(YEAR(Calculator!C334),\"\")","v":""},{"$f":"IFERROR(VLOOKUP(MONTH(Calculator!C334),'Month mapping'!A:B,2,0),\"\")","v":""},{"$f":"Calculator!D334","v":""},{"$f":"Calculator!E334","v":""},{"$f":"Calculator!G334","v":""},{"$f":"Calculator!H334","v":""},{"$f":"Calculator!I334","v":""},{"$f":"Calculator!J334","v":""}]
[{"$f":"IFERROR(YEAR(Calculator!C335),\"\")","v":""},{"$f":"IFERROR(VLOOKUP(MONTH(Calculator!C335),'Month mapping'!A:B,2,0),\"\")","v":""},{"$f":"Calculator!D335","v":""},{"$f":"Calculator!E335","v":""},{"$f":"Calculator!G335","v":""},{"$f":"Calculator!H335","v":""},{"$f":"Calculator!I335","v":""},{"$f":"Calculator!J335","v":""}]
[{"$f":"IFERROR(YEAR(Calculator!C336),\"\")","v":""},{"$f":"IFERROR(VLOOKUP(MONTH(Calculator!C336),'Month mapping'!A:B,2,0),\"\")","v":""},{"$f":"Calculator!D336","v":""},{"$f":"Calculator!E336","v":""},{"$f":"Calculator!G336","v":""},{"$f":"Calculator!H336","v":""},{"$f":"Calculator!I336","v":""},{"$f":"Calculator!J336","v":""}]
[{"$f":"IFERROR(YEAR(Calculator!C337),\"\")","v":""},{"$f":"IFERROR(VLOOKUP(MONTH(Calculator!C337),'Month mapping'!A:B,2,0),\"\")","v":""},{"$f":"Calculator!D337","v":""},{"$f":"Calculator!E337","v":""},{"$f":"Calculator!G337","v":""},{"$f":"Calculator!H337","v":""},{"$f":"Calculator!I337","v":""},{"$f":"Calculator!J337","v":""}]
[{"$f":"IFERROR(YEAR(Calculator!C338),\"\")","v":""},{"$f":"IFERROR(VLOOKUP(MONTH(Calculator!C338),'Month mapping'!A:B,2,0),\"\")","v":""},{"$f":"Calculator!D338","v":""},{"$f":"Calculator!E338","v":""},{"$f":"Calculator!G338","v":""},{"$f":"Calculator!H338","v":""},{"$f":"Calculator!I338","v":""},{"$f":"Calculator!J338","v":""}]
[{"$f":"IFERROR(YEAR(Calculator!C339),\"\")","v":""},{"$f":"IFERROR(VLOOKUP(MONTH(Calculator!C339),'Month mapping'!A:B,2,0),\"\")","v":""},{"$f":"Calculator!D339","v":""},{"$f":"Calculator!E339","v":""},{"$f":"Calculator!G339","v":""},{"$f":"Calculator!H339","v":""},{"$f":"Calculator!I339","v":""},{"$f":"Calculator!J339","v":""}]
[{"$f":"IFERROR(YEAR(Calculator!C340),\"\")","v":""},{"$f":"IFERROR(VLOOKUP(MONTH(Calculator!C340),'Month mapping'!A:B,2,0),\"\")","v":""},{"$f":"Calculator!D340","v":""},{"$f":"Calculator!E340","v":""},{"$f":"Calculator!G340","v":""},{"$f":"Calculator!H340","v":""},{"$f":"Calculator!I340","v":""},{"$f":"Calculator!J340","v":""}]
[{"$f":"IFERROR(YEAR(Calculator!C341),\"\")","v":""},{"$f":"IFERROR(VLOOKUP(MONTH(Calculator!C341),'Month mapping'!A:B,2,0),\"\")","v":""},{"$f":"Calculator!D341","v":""},{"$f":"Calculator!E341","v":""},{"$f":"Calculator!G341","v":""},{"$f":"Calculator!H341","v":""},{"$f":"Calculator!I341","v":""},{"$f":"Calculator!J341","v":""}]
[{"$f":"IFERROR(YEAR(Calculator!C342),\"\")","v":""},{"$f":"IFERROR(VLOOKUP(MONTH(Calculator!C342),'Month mapping'!A:B,2,0),\"\")","v":""},{"$f":"Calculator!D342","v":""},{"$f":"Calculator!E342","v":""},{"$f":"Calculator!G342","v":""},{"$f":"Calculator!H342","v":""},{"$f":"Calculator!I342","v":""},{"$f":"Calculator!J342","v":""}]
[{"$f":"IFERROR(YEAR(Calculator!C343),\"\")","v":""},{"$f":"IFERROR(VLOOKUP(MONTH(Calculator!C343),'Month mapping'!A:B,2,0),\"\")","v":""},{"$f":"Calculator!D343","v":""},{"$f":"Calculator!E343","v":""},{"$f":"Calculator!G343","v":""},{"$f":"Calculator!H343","v":""},{"$f":"Calculator!I343","v":""},{"$f":"Calculator!J343","v":""}]
[{"$f":"IFERROR(YEAR(Calculator!C344),\"\")","v":""},{"$f":"IFERROR(VLOOKUP(MONTH(Calculator!C344),'Month mapping'!A:B,2,0),\"\")","v":""},{"$f":"Calculator!D344","v":""},{"$f":"Calculator!E344","v":""},{"$f":"Calculator!G344","v":""},{"$f":"Calculator!H344","v":""},{"$f":"Calculator!I344","v":""},{"$f":"Calculator!J344","v":""}]
[{"$f":"IFERROR(YEAR(Calculator!C345),\"\")","v":""},{"$f":"IFERROR(VLOOKUP(MONTH(Calculator!C345),'Month mapping'!A:B,2,0),\"\")","v":""},{"$f":"Calculator!D345","v":""},{"$f":"Calculator!E345","v":""},{"$f":"Calculator!G345","v":""},{"$f":"Calculator!H345","v":""},{"$f":"Calculator!I345","v":""},{"$f":"Calculator!J345","v":""}]
[{"$f":"IFERROR(YEAR(Calculator!C346),\"\")","v":""},{"$f":"IFERROR(VLOOKUP(MONTH(Calculator!C346),'Month mapping'!A:B,2,0),\"\")","v":""},{"$f":"Calculator!D346","v":""},{"$f":"Calculator!E346","v":""},{"$f":"Calculator!G346","v":""},{"$f":"Calculator!H346","v":""},{"$f":"Calculator!I346","v":""},{"$f":"Calculator!J346","v":""}]
[{"$f":"IFERROR(YEAR(Calculator!C347),\"\")","v":""},{"$f":"IFERROR(VLOOKUP(MONTH(Calculator!C347),'Month mapping'!A:B,2,0),\"\")","v":""},{"$f":"Calculator!D347","v":""},{"$f":"Calculator!E347","v":""},{"$f":"Calculator!G347","v":""},{"$f":"Calculator!H347","v":""},{"$f":"Calculator!I347","v":""},{"$f":"Calculator!J347","v":""}]
[{"$f":"IFERROR(YEAR(Calculator!C348),\"\")","v":""},{"$f":"IFERROR(VLOOKUP(MONTH(Calculator!C348),'Month mapping'!A:B,2,0),\"\")","v":""},{"$f":"Calculator!D348","v":""},{"$f":"Calculator!E348","v":""},{"$f":"Calculator!G348","v":""},{"$f":"Calculator!H348","v":""},{"$f":"Calculator!I348","v":""},{"$f":"Calculator!J348","v":""}]
[{"$f":"IFERROR(YEAR(Calculator!C349),\"\")","v":""},{"$f":"IFERROR(VLOOKUP(MONTH(Calculator!C349),'Month mapping'!A:B,2,0),\"\")","v":""},{"$f":"Calculator!D349","v":""},{"$f":"Calculator!E349","v":""},{"$f":"Calculator!G349","v":""},{"$f":"Calculator!H349","v":""},{"$f":"Calculator!I349","v":""},{"$f":"Calculator!J349","v":""}]
[{"$f":"IFERROR(YEAR(Calculator!C350),\"\")","v":""},{"$f":"IFERROR(VLOOKUP(MONTH(Calculator!C350),'Month mapping'!A:B,2,0),\"\")","v":""},{"$f":"Calculator!D350","v":""},{"$f":"Calculator!E350","v":""},{"$f":"Calculator!G350","v":""},{"$f":"Calculator!H350","v":""},{"$f":"Calculator!I350","v":""},{"$f":"Calculator!J350","v":""}]
[{"$f":"IFERROR(YEAR(Calculator!C351),\"\")","v":""},{"$f":"IFERROR(VLOOKUP(MONTH(Calculator!C351),'Month mapping'!A:B,2,0),\"\")","v":""},{"$f":"Calculator!D351","v":""},{"$f":"Calculator!E351","v":""},{"$f":"Calculator!G351","v":""},{"$f":"Calculator!H351","v":""},{"$f":"Calculator!I351","v":""},{"$f":"Calculator!J351","v":""}]
[{"$f":"IFERROR(YEAR(Calculator!C352),\"\")","v":""},{"$f":"IFERROR(VLOOKUP(MONTH(Calculator!C352),'Month mapping'!A:B,2,0),\"\")","v":""},{"$f":"Calculator!D352","v":""},{"$f":"Calculator!E352","v":""},{"$f":"Calculator!G352","v":""},{"$f":"Calculator!H352","v":""},{"$f":"Calculator!I352","v":""},{"$f":"Calculator!J352","v":""}]
[{"$f":"IFERROR(YEAR(Calculator!C353),\"\")","v":""},{"$f":"IFERROR(VLOOKUP(MONTH(Calculator!C353),'Month mapping'!A:B,2,0),\"\")","v":""},{"$f":"Calculator!D353","v":""},{"$f":"Calculator!E353","v":""},{"$f":"Calculator!G353","v":""},{"$f":"Calculator!H353","v":""},{"$f":"Calculator!I353","v":""},{"$f":"Calculator!J353","v":""}]
[{"$f":"IFERROR(YEAR(Calculator!C354),\"\")","v":""},{"$f":"IFERROR(VLOOKUP(MONTH(Calculator!C354),'Month mapping'!A:B,2,0),\"\")","v":""},{"$f":"Calculator!D354","v":""},{"$f":"Calculator!E354","v":""},{"$f":"Calculator!G354","v":""},{"$f":"Calculator!H354","v":""},{"$f":"Calculator!I354","v":""},{"$f":"Calculator!J354","v":""}]
[{"$f":"IFERROR(YEAR(Calculator!C355),\"\")","v":""},{"$f":"IFERROR(VLOOKUP(MONTH(Calculator!C355),'Month mapping'!A:B,2,0),\"\")","v":""},{"$f":"Calculator!D355","v":""},{"$f":"Calculator!E355","v":""},{"$f":"Calculator!G355","v":""},{"$f":"Calculator!H355","v":""},{"$f":"Calculator!I355","v":""},{"$f":"Calculator!J355","v":""}]
[{"$f":"IFERROR(YEAR(Calculator!C356),\"\")","v":""},{"$f":"IFERROR(VLOOKUP(MONTH(Calculator!C356),'Month mapping'!A:B,2,0),\"\")","v":""},{"$f":"Calculator!D356","v":""},{"$f":"Calculator!E356","v":""},{"$f":"Calculator!G356","v":""},{"$f":"Calculator!H356","v":""},{"$f":"Calculator!I356","v":""},{"$f":"Calculator!J356","v":""}]
[{"$f":"IFERROR(YEAR(Calculator!C357),\"\")","v":""},{"$f":"IFERROR(VLOOKUP(MONTH(Calculator!C357),'Month mapping'!A:B,2,0),\"\")","v":""},{"$f":"Calculator!D357","v":""},{"$f":"Calculator!E357","v":""},{"$f":"Calculator!G357","v":""},{"$f":"Calculator!H357","v":""},{"$f":"Calculator!I357","v":""},{"$f":"Calculator!J357","v":""}]
[{"$f":"IFERROR(YEAR(Calculator!C358),\"\")","v":""},{"$f":"IFERROR(VLOOKUP(MONTH(Calculator!C358),'Month mapping'!A:B,2,0),\"\")","v":""},{"$f":"Calculator!D358","v":""},{"$f":"Calculator!E358","v":""},{"$f":"Calculator!G358","v":""},{"$f":"Calculator!H358","v":""},{"$f":"Calculator!I358","v":""},{"$f":"Calculator!J358","v":""}]
[{"$f":"IFERROR(YEAR(Calculator!C359),\"\")","v":""},{"$f":"IFERROR(VLOOKUP(MONTH(Calculator!C359),'Month mapping'!A:B,2,0),\"\")","v":""},{"$f":"Calculator!D359","v":""},{"$f":"Calculator!E359","v":""},{"$f":"Calculator!G359","v":""},{"$f":"Calculator!H359","v":""},{"$f":"Calculator!I359","v":""},{"$f":"Calculator!J359","v":""}]
[{"$f":"IFERROR(YEAR(Calculator!C360),\"\")","v":""},{"$f":"IFERROR(VLOOKUP(MONTH(Calculator!C360),'Month mapping'!A:B,2,0),\"\")","v":""},{"$f":"Calculator!D360","v":""},{"$f":"Calculator!E360","v":""},{"$f":"Calculator!G360","v":""},{"$f":"Calculator!H360","v":""},{"$f":"Calculator!I360","v":""},{"$f":"Calculator!J360","v":""}]
[{"$f":"IFERROR(YEAR(Calculator!C361),\"\")","v":""},{"$f":"IFERROR(VLOOKUP(MONTH(Calculator!C361),'Month mapping'!A:B,2,0),\"\")","v":""},{"$f":"Calculator!D361","v":""},{"$f":"Calculator!E361","v":""},{"$f":"Calculator!G361","v":""},{"$f":"Calculator!H361","v":""},{"$f":"Calculator!I361","v":""},{"$f":"Calculator!J361","v":""}]
[{"$f":"IFERROR(YEAR(Calculator!C362),\"\")","v":""},{"$f":"IFERROR(VLOOKUP(MONTH(Calculator!C362),'Month mapping'!A:B,2,0),\"\")","v":""},{"$f":"Calculator!D362","v":""},{"$f":"Calculator!E362","v":""},{"$f":"Calculator!G362","v":""},{"$f":"Calculator!H362","v":""},{"$f":"Calculator!I362","v":""},{"$f":"Calculator!J362","v":""}]
[{"$f":"IFERROR(YEAR(Calculator!C363),\"\")","v":""},{"$f":"IFERROR(VLOOKUP(MONTH(Calculator!C363),'Month mapping'!A:B,2,0),\"\")","v":""},{"$f":"Calculator!D363","v":""},{"$f":"Calculator!E363","v":""},{"$f":"Calculator!G363","v":""},{"$f":"Calculator!H363","v":""},{"$f":"Calculator!I363","v":""},{"$f":"Calculator!J363","v":""}]
[{"$f":"IFERROR(YEAR(Calculator!C364),\"\")","v":""},{"$f":"IFERROR(VLOOKUP(MONTH(Calculator!C364),'Month mapping'!A:B,2,0),\"\")","v":""},{"$f":"Calculator!D364","v":""},{"$f":"Calculator!E364","v":""},{"$f":"Calculator!G364","v":""},{"$f":"Calculator!H364","v":""},{"$f":"Calculator!I364","v":""},{"$f":"Calculator!J364","v":""}]
[{"$f":"IFERROR(YEAR(Calculator!C365),\"\")","v":""},{"$f":"IFERROR(VLOOKUP(MONTH(Calculator!C365),'Month mapping'!A:B,2,0),\"\")","v":""},{"$f":"Calculator!D365","v":""},{"$f":"Calculator!E365","v":""},{"$f":"Calculator!G365","v":""},{"$f":"Calculator!H365","v":""},{"$f":"Calculator!I365","v":""},{"$f":"Calculator!J365","v":""}]
[{"$f":"IFERROR(YEAR(Calculator!C366),\"\")","v":""},{"$f":"IFERROR(VLOOKUP(MONTH(Calculator!C366),'Month mapping'!A:B,2,0),\"\")","v":""},{"$f":"Calculator!D366","v":""},{"$f":"Calculator!E366","v":""},{"$f":"Calculator!G366","v":""},{"$f":"Calculator!H366","v":""},{"$f":"Calculator!I366","v":""},{"$f":"Calculator!J366","v":""}]
[{"$f":"IFERROR(YEAR(Calculator!C367),\"\")","v":""},{"$f":"IFERROR(VLOOKUP(MONTH(Calculator!C367),'Month mapping'!A:B,2,0),\"\")","v":""},{"$f":"Calculator!D367","v":""},{"$f":"Calculator!E367","v":""},{"$f":"Calculator!G367","v":""},{"$f":"Calculator!H367","v":""},{"$f":"Calculator!I367","v":""},{"$f":"Calculator!J367","v":""}]
[{"$f":"IFERROR(YEAR(Calculator!C368),\"\")","v":""},{"$f":"IFERROR(VLOOKUP(MONTH(Calculator!C368),'Month mapping'!A:B,2,0),\"\")","v":""},{"$f":"Calculator!D368","v":""},{"$f":"Calculator!E368","v":""},{"$f":"Calculator!G368","v":""},{"$f":"Calculator!H368","v":""},{"$f":"Calculator!I368","v":""},{"$f":"Calculator!J368","v":""}]
[{"$f":"IFERROR(YEAR(Calculator!C369),\"\")","v":""},{"$f":"IFERROR(VLOOKUP(MONTH(Calculator!C369),'Month mapping'!A:B,2,0),\"\")","v":""},{"$f":"Calculator!D369","v":""},{"$f":"Calculator!E369","v":""},{"$f":"Calculator!G369","v":""},{"$f":"Calculator!H369","v":""},{"$f":"Calculator!I369","v":""},{"$f":"Calculator!J369","v":""}]
[{"$f":"IFERROR(YEAR(Calculator!C370),\"\")","v":""},{"$f":"IFERROR(VLOOKUP(MONTH(Calculator!C370),'Month mapping'!A:B,2,0),\"\")","v":""},{"$f":"Calculator!D370","v":""},{"$f":"Calculator!E370","v":""},{"$f":"Calculator!G370","v":""},{"$f":"Calculator!H370","v":""},{"$f":"Calculator!I370","v":""},{"$f":"Calculator!J370","v":""}]
[{"$f":"IFERROR(YEAR(Calculator!C371),\"\")","v":""},{"$f":"IFERROR(VLOOKUP(MONTH(Calculator!C371),'Month mapping'!A:B,2,0),\"\")","v":""},{"$f":"Calculator!D371","v":""},{"$f":"Calculator!E371","v":""},{"$f":"Calculator!G371","v":""},{"$f":"Calculator!H371","v":""},{"$f":"Calculator!I371","v":""},{"$f":"Calculator!J371","v":""}]
[{"$f":"IFERROR(YEAR(Calculator!C372),\"\")","v":""},{"$f":"IFERROR(VLOOKUP(MONTH(Calculator!C372),'Month mapping'!A:B,2,0),\"\")","v":""},{"$f":"Calculator!D372","v":""},{"$f":"Calculator!E372","v":""},{"$f":"Calculator!G372","v":""},{"$f":"Calculator!H372","v":""},{"$f":"Calculator!I372","v":""},{"$f":"Calculator!J372","v":""}]
[{"$f":"IFERROR(YEAR(Calculator!C373),\"\")","v":""},{"$f":"IFERROR(VLOOKUP(MONTH(Calculator!C373),'Month mapping'!A:B,2,0),\"\")","v":""},{"$f":"Calculator!D373","v":""},{"$f":"Calculator!E373","v":""},{"$f":"Calculator!G373","v":""},{"$f":"Calculator!H373","v":""},{"$f":"Calculator!I373","v":""},{"$f":"Calculator!J373","v":""}]
[{"$f":"IFERROR(YEAR(Calculator!C374),\"\")","v":""},{"$f":"IFERROR(VLOOKUP(MONTH(Calculator!C374),'Month mapping'!A:B,2,0),\"\")","v":""},{"$f":"Calculator!D374","v":""},{"$f":"Calculator!E374","v":""},{"$f":"Calculator!G374","v":""},{"$f":"Calculator!H374","v":""},{"$f":"Calculator!I374","v":""},{"$f":"Calculator!J374","v":""}]
[{"$f":"IFERROR(YEAR(Calculator!C375),\"\")","v":""},{"$f":"IFERROR(VLOOKUP(MONTH(Calculator!C375),'Month mapping'!A:B,2,0),\"\")","v":""},{"$f":"Calculator!D375","v":""},{"$f":"Calculator!E375","v":""},{"$f":"Calculator!G375","v":""},{"$f":"Calculator!H375","v":""},{"$f":"Calculator!I375","v":""},{"$f":"Calculator!J375","v":""}]
[{"$f":"IFERROR(YEAR(Calculator!C376),\"\")","v":""},{"$f":"IFERROR(VLOOKUP(MONTH(Calculator!C376),'Month mapping'!A:B,2,0),\"\")","v":""},{"$f":"Calculator!D376","v":""},{"$f":"Calculator!E376","v":""},{"$f":"Calculator!G376","v":""},{"$f":"Calculator!H376","v":""},{"$f":"Calculator!I376","v":""},{"$f":"Calculator!J376","v":""}]
[{"$f":"IFERROR(YEAR(Calculator!C377),\"\")","v":""},{"$f":"IFERROR(VLOOKUP(MONTH(Calculator!C377),'Month mapping'!A:B,2,0),\"\")","v":""},{"$f":"Calculator!D377","v":""},{"$f":"Calculator!E377","v":""},{"$f":"Calculator!G377","v":""},{"$f":"Calculator!H377","v":""},{"$f":"Calculator!I377","v":""},{"$f":"Calculator!J377","v":""}]
[{"$f":"IFERROR(YEAR(Calculator!C378),\"\")","v":""},{"$f":"IFERROR(VLOOKUP(MONTH(Calculator!C378),'Month mapping'!A:B,2,0),\"\")","v":""},{"$f":"Calculator!D378","v":""},{"$f":"Calculator!E378","v":""},{"$f":"Calculator!G378","v":""},{"$f":"Calculator!H378","v":""},{"$f":"Calculator!I378","v":""},{"$f":"Calculator!J378","v":""}]
[{"$f":"IFERROR(YEAR(Calculator!C379),\"\")","v":""},{"$f":"IFERROR(VLOOKUP(MONTH(Calculator!C379),'Month mapping'!A:B,2,0),\"\")","v":""},{"$f":"Calculator!D379","v":""},{"$f":"Calculator!E379","v":""},{"$f":"Calculator!G379","v":""},{"$f":"Calculator!H379","v":""},{"$f":"Calculator!I379","v":""},{"$f":"Calculator!J379","v":""}]
[{"$f":"IFERROR(YEAR(Calculator!C380),\"\")","v":""},{"$f":"IFERROR(VLOOKUP(MONTH(Calculator!C380),'Month mapping'!A:B,2,0),\"\")","v":""},{"$f":"Calculator!D380","v":""},{"$f":"Calculator!E380","v":""},{"$f":"Calculator!G380","v":""},{"$f":"Calculator!H380","v":""},{"$f":"Calculator!I380","v":""},{"$f":"Calculator!J380","v":""}]
[{"$f":"IFERROR(YEAR(Calculator!C381),\"\")","v":""},{"$f":"IFERROR(VLOOKUP(MONTH(Calculator!C381),'Month mapping'!A:B,2,0),\"\")","v":""},{"$f":"Calculator!D381","v":""},{"$f":"Calculator!E381","v":""},{"$f":"Calculator!G381","v":""},{"$f":"Calculator!H381","v":""},{"$f":"Calculator!I381","v":""},{"$f":"Calculator!J381","v":""}]
[{"$f":"IFERROR(YEAR(Calculator!C382),\"\")","v":""},{"$f":"IFERROR(VLOOKUP(MONTH(Calculator!C382),'Month mapping'!A:B,2,0),\"\")","v":""},{"$f":"Calculator!D382","v":""},{"$f":"Calculator!E382","v":""},{"$f":"Calculator!G382","v":""},{"$f":"Calculator!H382","v":""},{"$f":"Calculator!I382","v":""},{"$f":"Calculator!J382","v":""}]
[{"$f":"IFERROR(YEAR(Calculator!C383),\"\")","v":""},{"$f":"IFERROR(VLOOKUP(MONTH(Calculator!C383),'Month mapping'!A:B,2,0),\"\")","v":""},{"$f":"Calculator!D383","v":""},{"$f":"Calculator!E383","v":""},{"$f":"Calculator!G383","v":""},{"$f":"Calculator!H383","v":""},{"$f":"Calculator!I383","v":""},{"$f":"Calculator!J383","v":""}]
[{"$f":"IFERROR(YEAR(Calculator!C384),\"\")","v":""},{"$f":"IFERROR(VLOOKUP(MONTH(Calculator!C384),'Month mapping'!A:B,2,0),\"\")","v":""},{"$f":"Calculator!D384","v":""},{"$f":"Calculator!E384","v":""},{"$f":"Calculator!G384","v":""},{"$f":"Calculator!H384","v":""},{"$f":"Calculator!I384","v":""},{"$f":"Calculator!J384","v":""}]
[{"$f":"IFERROR(YEAR(Calculator!C385),\"\")","v":""},{"$f":"IFERROR(VLOOKUP(MONTH(Calculator!C385),'Month mapping'!A:B,2,0),\"\")","v":""},{"$f":"Calculator!D385","v":""},{"$f":"Calculator!E385","v":""},{"$f":"Calculator!G385","v":""},{"$f":"Calculator!H385","v":""},{"$f":"Calculator!I385","v":""},{"$f":"Calculator!J385","v":""}]
[{"$f":"IFERROR(YEAR(Calculator!C386),\"\")","v":""},{"$f":"IFERROR(VLOOKUP(MONTH(Calculator!C386),'Month mapping'!A:B,2,0),\"\")","v":""},{"$f":"Calculator!D386","v":""},{"$f":"Calculator!E386","v":""},{"$f":"Calculator!G386","v":""},{"$f":"Calculator!H386","v":""},{"$f":"Calculator!I386","v":""},{"$f":"Calculator!J386","v":""}]
[{"$f":"IFERROR(YEAR(Calculator!C387),\"\")","v":""},{"$f":"IFERROR(VLOOKUP(MONTH(Calculator!C387),'Month mapping'!A:B,2,0),\"\")","v":""},{"$f":"Calculator!D387","v":""},{"$f":"Calculator!E387","v":""},{"$f":"Calculator!G387","v":""},{"$f":"Calculator!H387","v":""},{"$f":"Calculator!I387","v":""},{"$f":"Calculator!J387","v":""}]
[{"$f":"IFERROR(YEAR(Calculator!C388),\"\")","v":""},{"$f":"IFERROR(VLOOKUP(MONTH(Calculator!C388),'Month mapping'!A:B,2,0),\"\")","v":""},{"$f":"Calculator!D388","v":""},{"$f":"Calculator!E388","v":""},{"$f":"Calculator!G388","v":""},{"$f":"Calculator!H388","v":""},{"$f":"Calculator!I388","v":""},{"$f":"Calculator!J388","v":""}]
[{"$f":"IFERROR(YEAR(Calculator!C389),\"\")","v":""},{"$f":"IFERROR(VLOOKUP(MONTH(Calculator!C389),'Month mapping'!A:B,2,0),\"\")","v":""},{"$f":"Calculator!D389","v":""},{"$f":"Calculator!E389","v":""},{"$f":"Calculator!G389","v":""},{"$f":"Calculator!H389","v":""},{"$f":"Calculator!I389","v":""},{"$f":"Calculator!J389","v":""}]
[{"$f":"IFERROR(YEAR(Calculator!C390),\"\")","v":""},{"$f":"IFERROR(VLOOKUP(MONTH(Calculator!C390),'Month mapping'!A:B,2,0),\"\")","v":""},{"$f":"Calculator!D390","v":""},{"$f":"Calculator!E390","v":""},{"$f":"Calculator!G390","v":""},{"$f":"Calculator!H390","v":""},{"$f":"Calculator!I390","v":""},{"$f":"Calculator!J390","v":""}]
[{"$f":"IFERROR(YEAR(Calculator!C391),\"\")","v":""},{"$f":"IFERROR(VLOOKUP(MONTH(Calculator!C391),'Month mapping'!A:B,2,0),\"\")","v":""},{"$f":"Calculator!D391","v":""},{"$f":"Calculator!E391","v":""},{"$f":"Calculator!G391","v":""},{"$f":"Calculator!H391","v":""},{"$f":"Calculator!I391","v":""},{"$f":"Calculator!J391","v":""}]
[{"$f":"IFERROR(YEAR(Calculator!C392),\"\")","v":""},{"$f":"IFERROR(VLOOKUP(MONTH(Calculator!C392),'Month mapping'!A:B,2,0),\"\")","v":""},{"$f":"Calculator!D392","v":""},{"$f":"Calculator!E392","v":""},{"$f":"Calculator!G392","v":""},{"$f":"Calculator!H392","v":""},{"$f":"Calculator!I392","v":""},{"$f":"Calculator!J392","v":""}]
[{"$f":"IFERROR(YEAR(Calculator!C393),\"\")","v":""},{"$f":"IFERROR(VLOOKUP(MONTH(Calculator!C393),'Month mapping'!A:B,2,0),\"\")","v":""},{"$f":"Calculator!D393","v":""},{"$f":"Calculator!E393","v":""},{"$f":"Calculator!G393","v":""},{"$f":"Calculator!H393","v":""},{"$f":"Calculator!I393","v":""},{"$f":"Calculator!J393","v":""}]
[{"$f":"IFERROR(YEAR(Calculator!C394),\"\")","v":""},{"$f":"IFERROR(VLOOKUP(MONTH(Calculator!C394),'Month mapping'!A:B,2,0),\"\")","v":""},{"$f":"Calculator!D394","v":""},{"$f":"Calculator!E394","v":""},{"$f":"Calculator!G394","v":""},{"$f":"Calculator!H394","v":""},{"$f":"Calculator!I394","v":""},{"$f":"Calculator!J394","v":""}]
[{"$f":"IFERROR(YEAR(Calculator!C395),\"\")","v":""},{"$f":"IFERROR(VLOOKUP(MONTH(Calculator!C395),'Month mapping'!A:B,2,0),\"\")","v":""},{"$f":"Calculator!D395","v":""},{"$f":"Calculator!E395","v":""},{"$f":"Calculator!G395","v":""},{"$f":"Calculator!H395","v":""},{"$f":"Calculator!I395","v":""},{"$f":"Calculator!J395","v":""}]
[{"$f":"IFERROR(YEAR(Calculator!C396),\"\")","v":""},{"$f":"IFERROR(VLOOKUP(MONTH(Calculator!C396),'Month mapping'!A:B,2,0),\"\")","v":""},{"$f":"Calculator!D396","v":""},{"$f":"Calculator!E396","v":""},{"$f":"Calculator!G396","v":""},{"$f":"Calculator!H396","v":""},{"$f":"Calculator!I396","v":""},{"$f":"Calculator!J396","v":""}]
[{"$f":"IFERROR(YEAR(Calculator!C397),\"\")","v":""},{"$f":"IFERROR(VLOOKUP(MONTH(Calculator!C397),'Month mapping'!A:B,2,0),\"\")","v":""},{"$f":"Calculator!D397","v":""},{"$f":"Calculator!E397","v":""},{"$f":"Calculator!G397","v":""},{"$f":"Calculator!H397","v":""},{"$f":"Calculator!I397","v":""},{"$f":"Calculator!J397","v":""}]
[{"$f":"IFERROR(YEAR(Calculator!C398),\"\")","v":""},{"$f":"IFERROR(VLOOKUP(MONTH(Calculator!C398),'Month mapping'!A:B,2,0),\"\")","v":""},{"$f":"Calculator!D398","v":""},{"$f":"Calculator!E398","v":""},{"$f":"Calculator!G398","v":""},{"$f":"Calculator!H398","v":""},{"$f":"Calculator!I398","v":""},{"$f":"Calculator!J398","v":""}]
[{"$f":"IFERROR(YEAR(Calculator!C399),\"\")","v":""},{"$f":"IFERROR(VLOOKUP(MONTH(Calculator!C399),'Month mapping'!A:B,2,0),\"\")","v":""},{"$f":"Calculator!D399","v":""},{"$f":"Calculator!E399","v":""},{"$f":"Calculator!G399","v":""},{"$f":"Calculator!H399","v":""},{"$f":"Calculator!I399","v":""},{"$f":"Calculator!J399","v":""}]
[{"$f":"IFERROR(YEAR(Calculator!C400),\"\")","v":""},{"$f":"IFERROR(VLOOKUP(MONTH(Calculator!C400),'Month mapping'!A:B,2,0),\"\")","v":""},{"$f":"Calculator!D400","v":""},{"$f":"Calculator!E400","v":""},{"$f":"Calculator!G400","v":""},{"$f":"Calculator!H400","v":""},{"$f":"Calculator!I400","v":""},{"$f":"Calculator!J400","v":""}]
[{"$f":"IFERROR(YEAR(Calculator!C401),\"\")","v":""},{"$f":"IFERROR(VLOOKUP(MONTH(Calculator!C401),'Month mapping'!A:B,2,0),\"\")","v":""},{"$f":"Calculator!D401","v":""},{"$f":"Calculator!E401","v":""},{"$f":"Calculator!G401","v":""},{"$f":"Calculator!H401","v":""},{"$f":"Calculator!I401","v":""},{"$f":"Calculator!J401","v":""}]
[{"$f":"IFERROR(YEAR(Calculator!C402),\"\")","v":""},{"$f":"IFERROR(VLOOKUP(MONTH(Calculator!C402),'Month mapping'!A:B,2,0),\"\")","v":""},{"$f":"Calculator!D402","v":""},{"$f":"Calculator!E402","v":""},{"$f":"Calculator!G402","v":""},{"$f":"Calculator!H402","v":""},{"$f":"Calculator!I402","v":""},{"$f":"Calculator!J402","v":""}]
[{"$f":"IFERROR(YEAR(Calculator!C403),\"\")","v":""},{"$f":"IFERROR(VLOOKUP(MONTH(Calculator!C403),'Month mapping'!A:B,2,0),\"\")","v":""},{"$f":"Calculator!D403","v":""},{"$f":"Calculator!E403","v":""},{"$f":"Calculator!G403","v":""},{"$f":"Calculator!H403","v":""},{"$f":"Calculator!I403","v":""},{"$f":"Calculator!J403","v":""}]
[{"$f":"IFERROR(YEAR(Calculator!C404),\"\")","v":""},{"$f":"IFERROR(VLOOKUP(MONTH(Calculator!C404),'Month mapping'!A:B,2,0),\"\")","v":""},{"$f":"Calculator!D404","v":""},{"$f":"Calculator!E404","v":""},{"$f":"Calculator!G404","v":""},{"$f":"Calculator!H404","v":""},{"$f":"Calculator!I404","v":""},{"$f":"Calculator!J404","v":""}]
[{"$f":"IFERROR(YEAR(Calculator!C405),\"\")","v":""},{"$f":"IFERROR(VLOOKUP(MONTH(Calculator!C405),'Month mapping'!A:B,2,0),\"\")","v":""},{"$f":"Calculator!D405","v":""},{"$f":"Calculator!E405","v":""},{"$f":"Calculator!G405","v":""},{"$f":"Calculator!H405","v":""},{"$f":"Calculator!I405","v":""},{"$f":"Calculator!J405","v":""}]
[{"$f":"IFERROR(YEAR(Calculator!C406),\"\")","v":""},{"$f":"IFERROR(VLOOKUP(MONTH(Calculator!C406),'Month mapping'!A:B,2,0),\"\")","v":""},{"$f":"Calculator!D406","v":""},{"$f":"Calculator!E406","v":""},{"$f":"Calculator!G406","v":""},{"$f":"Calculator!H406","v":""},{"$f":"Calculator!I406","v":""},{"$f":"Calculator!J406","v":""}]
[{"$f":"IFERROR(YEAR(Calculator!C407),\"\")","v":""},{"$f":"IFERROR(VLOOKUP(MONTH(Calculator!C407),'Month mapping'!A:B,2,0),\"\")","v":""},{"$f":"Calculator!D407","v":""},{"$f":"Calculator!E407","v":""},{"$f":"Calculator!G407","v":""},{"$f":"Calculator!H407","v":""},{"$f":"Calculator!I407","v":""},{"$f":"Calculator!J407","v":""}]
[{"$f":"IFERROR(YEAR(Calculator!C408),\"\")","v":""},{"$f":"IFERROR(VLOOKUP(MONTH(Calculator!C408),'Month mapping'!A:B,2,0),\"\")","v":""},{"$f":"Calculator!D408","v":""},{"$f":"Calculator!E408","v":""},{"$f":"Calculator!G408","v":""},{"$f":"Calculator!H408","v":""},{"$f":"Calculator!I408","v":""},{"$f":"Calculator!J408","v":""}]
[{"$f":"IFERROR(YEAR(Calculator!C409),\"\")","v":""},{"$f":"IFERROR(VLOOKUP(MONTH(Calculator!C409),'Month mapping'!A:B,2,0),\"\")","v":""},{"$f":"Calculator!D409","v":""},{"$f":"Calculator!E409","v":""},{"$f":"Calculator!G409","v":""},{"$f":"Calculator!H409","v":""},{"$f":"Calculator!I409","v":""},{"$f":"Calculator!J409","v":""}]
[{"$f":"IFERROR(YEAR(Calculator!C410),\"\")","v":""},{"$f":"IFERROR(VLOOKUP(MONTH(Calculator!C410),'Month mapping'!A:B,2,0),\"\")","v":""},{"$f":"Calculator!D410","v":""},{"$f":"Calculator!E410","v":""},{"$f":"Calculator!G410","v":""},{"$f":"Calculator!H410","v":""},{"$f":"Calculator!I410","v":""},{"$f":"Calculator!J410","v":""}]
[{"$f":"IFERROR(YEAR(Calculator!C411),\"\")","v":""},{"$f":"IFERROR(VLOOKUP(MONTH(Calculator!C411),'Month mapping'!A:B,2,0),\"\")","v":""},{"$f":"Calculator!D411","v":""},{"$f":"Calculator!E411","v":""},{"$f":"Calculator!G411","v":""},{"$f":"Calculator!H411","v":""},{"$f":"Calculator!I411","v":""},{"$f":"Calculator!J411","v":""}]
[{"$f":"IFERROR(YEAR(Calculator!C412),\"\")","v":""},{"$f":"IFERROR(VLOOKUP(MONTH(Calculator!C412),'Month mapping'!A:B,2,0),\"\")","v":""},{"$f":"Calculator!D412","v":""},{"$f":"Calculator!E412","v":""},{"$f":"Calculator!G412","v":""},{"$f":"Calculator!H412","v":""},{"$f":"Calculator!I412","v":""},{"$f":"Calculator!J412","v":""}]
[{"$f":"IFERROR(YEAR(Calculator!C413),\"\")","v":""},{"$f":"IFERROR(VLOOKUP(MONTH(Calculator!C413),'Month mapping'!A:B,2,0),\"\")","v":""},{"$f":"Calculator!D413","v":""},{"$f":"Calculator!E413","v":""},{"$f":"Calculator!G413","v":""},{"$f":"Calculator!H413","v":""},{"$f":"Calculator!I413","v":""},{"$f":"Calculator!J413","v":""}]
[{"$f":"IFERROR(YEAR(Calculator!C414),\"\")","v":""},{"$f":"IFERROR(VLOOKUP(MONTH(Calculator!C414),'Month mapping'!A:B,2,0),\"\")","v":""},{"$f":"Calculator!D414","v":""},{"$f":"Calculator!E414","v":""},{"$f":"Calculator!G414","v":""},{"$f":"Calculator!H414","v":""},{"$f":"Calculator!I414","v":""},{"$f":"Calculator!J414","v":""}]
[{"$f":"IFERROR(YEAR(Calculator!C415),\"\")","v":""},{"$f":"IFERROR(VLOOKUP(MONTH(Calculator!C415),'Month mapping'!A:B,2,0),\"\")","v":""},{"$f":"Calculator!D415","v":""},{"$f":"Calculator!E415","v":""},{"$f":"Calculator!G415","v":""},{"$f":"Calculator!H415","v":""},{"$f":"Calculator!I415","v":""},{"$f":"Calculator!J415","v":""}]
[{"$f":"IFERROR(YEAR(Calculator!C416),\"\")","v":""},{"$f":"IFERROR(VLOOKUP(MONTH(Calculator!C416),'Month mapping'!A:B,2,0),\"\")","v":""},{"$f":"Calculator!D416","v":""},{"$f":"Calculator!E416","v":""},{"$f":"Calculator!G416","v":""},{"$f":"Calculator!H416","v":""},{"$f":"Calculator!I416","v":""},{"$f":"Calculator!J416","v":""}]
[{"$f":"IFERROR(YEAR(Calculator!C417),\"\")","v":""},{"$f":"IFERROR(VLOOKUP(MONTH(Calculator!C417),'Month mapping'!A:B,2,0),\"\")","v":""},{"$f":"Calculator!D417","v":""},{"$f":"Calculator!E417","v":""},{"$f":"Calculator!G417","v":""},{"$f":"Calculator!H417","v":""},{"$f":"Calculator!I417","v":""},{"$f":"Calculator!J417","v":""}]
[{"$f":"IFERROR(YEAR(Calculator!C418),\"\")","v":""},{"$f":"IFERROR(VLOOKUP(MONTH(Calculator!C418),'Month mapping'!A:B,2,0),\"\")","v":""},{"$f":"Calculator!D418","v":""},{"$f":"Calculator!E418","v":""},{"$f":"Calculator!G418","v":""},{"$f":"Calculator!H418","v":""},{"$f":"Calculator!I418","v":""},{"$f":"Calculator!J418","v":""}]
[{"$f":"IFERROR(YEAR(Calculator!C419),\"\")","v":""},{"$f":"IFERROR(VLOOKUP(MONTH(Calculator!C419),'Month mapping'!A:B,2,0),\"\")","v":""},{"$f":"Calculator!D419","v":""},{"$f":"Calculator!E419","v":""},{"$f":"Calculator!G419","v":""},{"$f":"Calculator!H419","v":""},{"$f":"Calculator!I419","v":""},{"$f":"Calculator!J419","v":""}]
[{"$f":"IFERROR(YEAR(Calculator!C420),\"\")","v":""},{"$f":"IFERROR(VLOOKUP(MONTH(Calculator!C420),'Month mapping'!A:B,2,0),\"\")","v":""},{"$f":"Calculator!D420","v":""},{"$f":"Calculator!E420","v":""},{"$f":"Calculator!G420","v":""},{"$f":"Calculator!H420","v":""},{"$f":"Calculator!I420","v":""},{"$f":"Calculator!J420","v":""}]
[{"$f":"IFERROR(YEAR(Calculator!C421),\"\")","v":""},{"$f":"IFERROR(VLOOKUP(MONTH(Calculator!C421),'Month mapping'!A:B,2,0),\"\")","v":""},{"$f":"Calculator!D421","v":""},{"$f":"Calculator!E421","v":""},{"$f":"Calculator!G421","v":""},{"$f":"Calculator!H421","v":""},{"$f":"Calculator!I421","v":""},{"$f":"Calculator!J421","v":""}]
[{"$f":"IFERROR(YEAR(Calculator!C422),\"\")","v":""},{"$f":"IFERROR(VLOOKUP(MONTH(Calculator!C422),'Month mapping'!A:B,2,0),\"\")","v":""},{"$f":"Calculator!D422","v":""},{"$f":"Calculator!E422","v":""},{"$f":"Calculator!G422","v":""},{"$f":"Calculator!H422","v":""},{"$f":"Calculator!I422","v":""},{"$f":"Calculator!J422","v":""}]
[{"$f":"IFERROR(YEAR(Calculator!C423),\"\")","v":""},{"$f":"IFERROR(VLOOKUP(MONTH(Calculator!C423),'Month mapping'!A:B,2,0),\"\")","v":""},{"$f":"Calculator!D423","v":""},{"$f":"Calculator!E423","v":""},{"$f":"Calculator!G423","v":""},{"$f":"Calculator!H423","v":""},{"$f":"Calculator!I423","v":""},{"$f":"Calculator!J423","v":""}]
[{"$f":"IFERROR(YEAR(Calculator!C424),\"\")","v":""},{"$f":"IFERROR(VLOOKUP(MONTH(Calculator!C424),'Month mapping'!A:B,2,0),\"\")","v":""},{"$f":"Calculator!D424","v":""},{"$f":"Calculator!E424","v":""},{"$f":"Calculator!G424","v":""},{"$f":"Calculator!H424","v":""},{"$f":"Calculator!I424","v":""},{"$f":"Calculator!J424","v":""}]
[{"$f":"IFERROR(YEAR(Calculator!C425),\"\")","v":""},{"$f":"IFERROR(VLOOKUP(MONTH(Calculator!C425),'Month mapping'!A:B,2,0),\"\")","v":""},{"$f":"Calculator!D425","v":""},{"$f":"Calculator!E425","v":""},{"$f":"Calculator!G425","v":""},{"$f":"Calculator!H425","v":""},{"$f":"Calculator!I425","v":""},{"$f":"Calculator!J425","v":""}]
[{"$f":"IFERROR(YEAR(Calculator!C426),\"\")","v":""},{"$f":"IFERROR(VLOOKUP(MONTH(Calculator!C426),'Month mapping'!A:B,2,0),\"\")","v":""},{"$f":"Calculator!D426","v":""},{"$f":"Calculator!E426","v":""},{"$f":"Calculator!G426","v":""},{"$f":"Calculator!H426","v":""},{"$f":"Calculator!I426","v":""},{"$f":"Calculator!J426","v":""}]
[{"$f":"IFERROR(YEAR(Calculator!C427),\"\")","v":""},{"$f":"IFERROR(VLOOKUP(MONTH(Calculator!C427),'Month mapping'!A:B,2,0),\"\")","v":""},{"$f":"Calculator!D427","v":""},{"$f":"Calculator!E427","v":""},{"$f":"Calculator!G427","v":""},{"$f":"Calculator!H427","v":""},{"$f":"Calculator!I427","v":""},{"$f":"Calculator!J427","v":""}]
[{"$f":"IFERROR(YEAR(Calculator!C428),\"\")","v":""},{"$f":"IFERROR(VLOOKUP(MONTH(Calculator!C428),'Month mapping'!A:B,2,0),\"\")","v":""},{"$f":"Calculator!D428","v":""},{"$f":"Calculator!E428","v":""},{"$f":"Calculator!G428","v":""},{"$f":"Calculator!H428","v":""},{"$f":"Calculator!I428","v":""},{"$f":"Calculator!J428","v":""}]
[{"$f":"IFERROR(YEAR(Calculator!C429),\"\")","v":""},{"$f":"IFERROR(VLOOKUP(MONTH(Calculator!C429),'Month mapping'!A:B,2,0),\"\")","v":""},{"$f":"Calculator!D429","v":""},{"$f":"Calculator!E429","v":""},{"$f":"Calculator!G429","v":""},{"$f":"Calculator!H429","v":""},{"$f":"Calculator!I429","v":""},{"$f":"Calculator!J429","v":""}]
[{"$f":"IFERROR(YEAR(Calculator!C430),\"\")","v":""},{"$f":"IFERROR(VLOOKUP(MONTH(Calculator!C430),'Month mapping'!A:B,2,0),\"\")","v":""},{"$f":"Calculator!D430","v":""},{"$f":"Calculator!E430","v":""},{"$f":"Calculator!G430","v":""},{"$f":"Calculator!H430","v":""},{"$f":"Calculator!I430","v":""},{"$f":"Calculator!J430","v":""}]
[{"$f":"IFERROR(YEAR(Calculator!C431),\"\")","v":""},{"$f":"IFERROR(VLOOKUP(MONTH(Calculator!C431),'Month mapping'!A:B,2,0),\"\")","v":""},{"$f":"Calculator!D431","v":""},{"$f":"Calculator!E431","v":""},{"$f":"Calculator!G431","v":""},{"$f":"Calculator!H431","v":""},{"$f":"Calculator!I431","v":""},{"$f":"Calculator!J431","v":""}]
[{"$f":"IFERROR(YEAR(Calculator!C432),\"\")","v":""},{"$f":"IFERROR(VLOOKUP(MONTH(Calculator!C432),'Month mapping'!A:B,2,0),\"\")","v":""},{"$f":"Calculator!D432","v":""},{"$f":"Calculator!E432","v":""},{"$f":"Calculator!G432","v":""},{"$f":"Calculator!H432","v":""},{"$f":"Calculator!I432","v":""},{"$f":"Calculator!J432","v":""}]
[{"$f":"IFERROR(YEAR(Calculator!C433),\"\")","v":""},{"$f":"IFERROR(VLOOKUP(MONTH(Calculator!C433),'Month mapping'!A:B,2,0),\"\")","v":""},{"$f":"Calculator!D433","v":""},{"$f":"Calculator!E433","v":""},{"$f":"Calculator!G433","v":""},{"$f":"Calculator!H433","v":""},{"$f":"Calculator!I433","v":""},{"$f":"Calculator!J433","v":""}]
[{"$f":"IFERROR(YEAR(Calculator!C434),\"\")","v":""},{"$f":"IFERROR(VLOOKUP(MONTH(Calculator!C434),'Month mapping'!A:B,2,0),\"\")","v":""},{"$f":"Calculator!D434","v":""},{"$f":"Calculator!E434","v":""},{"$f":"Calculator!G434","v":""},{"$f":"Calculator!H434","v":""},{"$f":"Calculator!I434","v":""},{"$f":"Calculator!J434","v":""}]
[{"$f":"IFERROR(YEAR(Calculator!C435),\"\")","v":""},{"$f":"IFERROR(VLOOKUP(MONTH(Calculator!C435),'Month mapping'!A:B,2,0),\"\")","v":""},{"$f":"Calculator!D435","v":""},{"$f":"Calculator!E435","v":""},{"$f":"Calculator!G435","v":""},{"$f":"Calculator!H435","v":""},{"$f":"Calculator!I435","v":""},{"$f":"Calculator!J435","v":""}]
[{"$f":"IFERROR(YEAR(Calculator!C436),\"\")","v":""},{"$f":"IFERROR(VLOOKUP(MONTH(Calculator!C436),'Month mapping'!A:B,2,0),\"\")","v":""},{"$f":"Calculator!D436","v":""},{"$f":"Calculator!E436","v":""},{"$f":"Calculator!G436","v":""},{"$f":"Calculator!H436","v":""},{"$f":"Calculator!I436","v":""},{"$f":"Calculator!J436","v":""}]
[{"$f":"IFERROR(YEAR(Calculator!C437),\"\")","v":""},{"$f":"IFERROR(VLOOKUP(MONTH(Calculator!C437),'Month mapping'!A:B,2,0),\"\")","v":""},{"$f":"Calculator!D437","v":""},{"$f":"Calculator!E437","v":""},{"$f":"Calculator!G437","v":""},{"$f":"Calculator!H437","v":""},{"$f":"Calculator!I437","v":""},{"$f":"Calculator!J437","v":""}]
[{"$f":"IFERROR(YEAR(Calculator!C438),\"\")","v":""},{"$f":"IFERROR(VLOOKUP(MONTH(Calculator!C438),'Month mapping'!A:B,2,0),\"\")","v":""},{"$f":"Calculator!D438","v":""},{"$f":"Calculator!E438","v":""},{"$f":"Calculator!G438","v":""},{"$f":"Calculator!H438","v":""},{"$f":"Calculator!I438","v":""},{"$f":"Calculator!J438","v":""}]
[{"$f":"IFERROR(YEAR(Calculator!C439),\"\")","v":""},{"$f":"IFERROR(VLOOKUP(MONTH(Calculator!C439),'Month mapping'!A:B,2,0),\"\")","v":""},{"$f":"Calculator!D439","v":""},{"$f":"Calculator!E439","v":""},{"$f":"Calculator!G439","v":""},{"$f":"Calculator!H439","v":""},{"$f":"Calculator!I439","v":""},{"$f":"Calculator!J439","v":""}]
[{"$f":"IFERROR(YEAR(Calculator!C440),\"\")","v":""},{"$f":"IFERROR(VLOOKUP(MONTH(Calculator!C440),'Month mapping'!A:B,2,0),\"\")","v":""},{"$f":"Calculator!D440","v":""},{"$f":"Calculator!E440","v":""},{"$f":"Calculator!G440","v":""},{"$f":"Calculator!H440","v":""},{"$f":"Calculator!I440","v":""},{"$f":"Calculator!J440","v":""}]
[{"$f":"IFERROR(YEAR(Calculator!C441),\"\")","v":""},{"$f":"IFERROR(VLOOKUP(MONTH(Calculator!C441),'Month mapping'!A:B,2,0),\"\")","v":""},{"$f":"Calculator!D441","v":""},{"$f":"Calculator!E441","v":""},{"$f":"Calculator!G441","v":""},{"$f":"Calculator!H441","v":""},{"$f":"Calculator!I441","v":""},{"$f":"Calculator!J441","v":""}]
[{"$f":"IFERROR(YEAR(Calculator!C442),\"\")","v":""},{"$f":"IFERROR(VLOOKUP(MONTH(Calculator!C442),'Month mapping'!A:B,2,0),\"\")","v":""},{"$f":"Calculator!D442","v":""},{"$f":"Calculator!E442","v":""},{"$f":"Calculator!G442","v":""},{"$f":"Calculator!H442","v":""},{"$f":"Calculator!I442","v":""},{"$f":"Calculator!J442","v":""}]
[{"$f":"IFERROR(YEAR(Calculator!C443),\"\")","v":""},{"$f":"IFERROR(VLOOKUP(MONTH(Calculator!C443),'Month mapping'!A:B,2,0),\"\")","v":""},{"$f":"Calculator!D443","v":""},{"$f":"Calculator!E443","v":""},{"$f":"Calculator!G443","v":""},{"$f":"Calculator!H443","v":""},{"$f":"Calculator!I443","v":""},{"$f":"Calculator!J443","v":""}]
[{"$f":"IFERROR(YEAR(Calculator!C444),\"\")","v":""},{"$f":"IFERROR(VLOOKUP(MONTH(Calculator!C444),'Month mapping'!A:B,2,0),\"\")","v":""},{"$f":"Calculator!D444","v":""},{"$f":"Calculator!E444","v":""},{"$f":"Calculator!G444","v":""},{"$f":"Calculator!H444","v":""},{"$f":"Calculator!I444","v":""},{"$f":"Calculator!J444","v":""}]
[{"$f":"IFERROR(YEAR(Calculator!C445),\"\")","v":""},{"$f":"IFERROR(VLOOKUP(MONTH(Calculator!C445),'Month mapping'!A:B,2,0),\"\")","v":""},{"$f":"Calculator!D445","v":""},{"$f":"Calculator!E445","v":""},{"$f":"Calculator!G445","v":""},{"$f":"Calculator!H445","v":""},{"$f":"Calculator!I445","v":""},{"$f":"Calculator!J445","v":""}]
[{"$f":"IFERROR(YEAR(Calculator!C446),\"\")","v":""},{"$f":"IFERROR(VLOOKUP(MONTH(Calculator!C446),'Month mapping'!A:B,2,0),\"\")","v":""},{"$f":"Calculator!D446","v":""},{"$f":"Calculator!E446","v":""},{"$f":"Calculator!G446","v":""},{"$f":"Calculator!H446","v":""},{"$f":"Calculator!I446","v":""},{"$f":"Calculator!J446","v":""}]
[{"$f":"IFERROR(YEAR(Calculator!C447),\"\")","v":""},{"$f":"IFERROR(VLOOKUP(MONTH(Calculator!C447),'Month mapping'!A:B,2,0),\"\")","v":""},{"$f":"Calculator!D447","v":""},{"$f":"Calculator!E447","v":""},{"$f":"Calculator!G447","v":""},{"$f":"Calculator!H447","v":""},{"$f":"Calculator!I447","v":""},{"$f":"Calculator!J447","v":""}]
[{"$f":"IFERROR(YEAR(Calculator!C448),\"\")","v":""},{"$f":"IFERROR(VLOOKUP(MONTH(Calculator!C448),'Month mapping'!A:B,2,0),\"\")","v":""},{"$f":"Calculator!D448","v":""},{"$f":"Calculator!E448","v":""},{"$f":"Calculator!G448","v":""},{"$f":"Calculator!H448","v":""},{"$f":"Calculator!I448","v":""},{"$f":"Calculator!J448","v":""}]
[{"$f":"IFERROR(YEAR(Calculator!C449),\"\")","v":""},{"$f":"IFERROR(VLOOKUP(MONTH(Calculator!C449),'Month mapping'!A:B,2,0),\"\")","v":""},{"$f":"Calculator!D449","v":""},{"$f":"Calculator!E449","v":""},{"$f":"Calculator!G449","v":""},{"$f":"Calculator!H449","v":""},{"$f":"Calculator!I449","v":""},{"$f":"Calculator!J449","v":""}]
[{"$f":"IFERROR(YEAR(Calculator!C450),\"\")","v":""},{"$f":"IFERROR(VLOOKUP(MONTH(Calculator!C450),'Month mapping'!A:B,2,0),\"\")","v":""},{"$f":"Calculator!D450","v":""},{"$f":"Calculator!E450","v":""},{"$f":"Calculator!G450","v":""},{"$f":"Calculator!H450","v":""},{"$f":"Calculator!I450","v":""},{"$f":"Calculator!J450","v":""}]
[{"$f":"IFERROR(YEAR(Calculator!C451),\"\")","v":""},{"$f":"IFERROR(VLOOKUP(MONTH(Calculator!C451),'Month mapping'!A:B,2,0),\"\")","v":""},{"$f":"Calculator!D451","v":""},{"$f":"Calculator!E451","v":""},{"$f":"Calculator!G451","v":""},{"$f":"Calculator!H451","v":""},{"$f":"Calculator!I451","v":""},{"$f":"Calculator!J451","v":""}]
[{"$f":"IFERROR(YEAR(Calculator!C452),\"\")","v":""},{"$f":"IFERROR(VLOOKUP(MONTH(Calculator!C452),'Month mapping'!A:B,2,0),\"\")","v":""},{"$f":"Calculator!D452","v":""},{"$f":"Calculator!E452","v":""},{"$f":"Calculator!G452","v":""},{"$f":"Calculator!H452","v":""},{"$f":"Calculator!I452","v":""},{"$f":"Calculator!J452","v":""}]
[{"$f":"IFERROR(YEAR(Calculator!C453),\"\")","v":""},{"$f":"IFERROR(VLOOKUP(MONTH(Calculator!C453),'Month mapping'!A:B,2,0),\"\")","v":""},{"$f":"Calculator!D453","v":""},{"$f":"Calculator!E453","v":""},{"$f":"Calculator!G453","v":""},{"$f":"Calculator!H453","v":""},{"$f":"Calculator!I453","v":""},{"$f":"Calculator!J453","v":""}]
[{"$f":"IFERROR(YEAR(Calculator!C454),\"\")","v":""},{"$f":"IFERROR(VLOOKUP(MONTH(Calculator!C454),'Month mapping'!A:B,2,0),\"\")","v":""},{"$f":"Calculator!D454","v":""},{"$f":"Calculator!E454","v":""},{"$f":"Calculator!G454","v":""},{"$f":"Calculator!H454","v":""},{"$f":"Calculator!I454","v":""},{"$f":"Calculator!J454","v":""}]
[{"$f":"IFERROR(YEAR(Calculator!C455),\"\")","v":""},{"$f":"IFERROR(VLOOKUP(MONTH(Calculator!C455),'Month mapping'!A:B,2,0),\"\")","v":""},{"$f":"Calculator!D455","v":""},{"$f":"Calculator!E455","v":""},{"$f":"Calculator!G455","v":""},{"$f":"Calculator!H455","v":""},{"$f":"Calculator!I455","v":""},{"$f":"Calculator!J455","v":""}]
[{"$f":"IFERROR(YEAR(Calculator!C456),\"\")","v":""},{"$f":"IFERROR(VLOOKUP(MONTH(Calculator!C456),'Month mapping'!A:B,2,0),\"\")","v":""},{"$f":"Calculator!D456","v":""},{"$f":"Calculator!E456","v":""},{"$f":"Calculator!G456","v":""},{"$f":"Calculator!H456","v":""},{"$f":"Calculator!I456","v":""},{"$f":"Calculator!J456","v":""}]
[{"$f":"IFERROR(YEAR(Calculator!C457),\"\")","v":""},{"$f":"IFERROR(VLOOKUP(MONTH(Calculator!C457),'Month mapping'!A:B,2,0),\"\")","v":""},{"$f":"Calculator!D457","v":""},{"$f":"Calculator!E457","v":""},{"$f":"Calculator!G457","v":""},{"$f":"Calculator!H457","v":""},{"$f":"Calculator!I457","v":""},{"$f":"Calculator!J457","v":""}]
[{"$f":"IFERROR(YEAR(Calculator!C458),\"\")","v":""},{"$f":"IFERROR(VLOOKUP(MONTH(Calculator!C458),'Month mapping'!A:B,2,0),\"\")","v":""},{"$f":"Calculator!D458","v":""},{"$f":"Calculator!E458","v":""},{"$f":"Calculator!G458","v":""},{"$f":"Calculator!H458","v":""},{"$f":"Calculator!I458","v":""},{"$f":"Calculator!J458","v":""}]
[{"$f":"IFERROR(YEAR(Calculator!C459),\"\")","v":""},{"$f":"IFERROR(VLOOKUP(MONTH(Calculator!C459),'Month mapping'!A:B,2,0),\"\")","v":""},{"$f":"Calculator!D459","v":""},{"$f":"Calculator!E459","v":""},{"$f":"Calculator!G459","v":""},{"$f":"Calculator!H459","v":""},{"$f":"Calculator!I459","v":""},{"$f":"Calculator!J459","v":""}]
[{"$f":"IFERROR(YEAR(Calculator!C460),\"\")","v":""},{"$f":"IFERROR(VLOOKUP(MONTH(Calculator!C460),'Month mapping'!A:B,2,0),\"\")","v":""},{"$f":"Calculator!D460","v":""},{"$f":"Calculator!E460","v":""},{"$f":"Calculator!G460","v":""},{"$f":"Calculator!H460","v":""},{"$f":"Calculator!I460","v":""},{"$f":"Calculator!J460","v":""}]
[{"$f":"IFERROR(YEAR(Calculator!C461),\"\")","v":""},{"$f":"IFERROR(VLOOKUP(MONTH(Calculator!C461),'Month mapping'!A:B,2,0),\"\")","v":""},{"$f":"Calculator!D461","v":""},{"$f":"Calculator!E461","v":""},{"$f":"Calculator!G461","v":""},{"$f":"Calculator!H461","v":""},{"$f":"Calculator!I461","v":""},{"$f":"Calculator!J461","v":""}]
[{"$f":"IFERROR(YEAR(Calculator!C462),\"\")","v":""},{"$f":"IFERROR(VLOOKUP(MONTH(Calculator!C462),'Month mapping'!A:B,2,0),\"\")","v":""},{"$f":"Calculator!D462","v":""},{"$f":"Calculator!E462","v":""},{"$f":"Calculator!G462","v":""},{"$f":"Calculator!H462","v":""},{"$f":"Calculator!I462","v":""},{"$f":"Calculator!J462","v":""}]
[{"$f":"IFERROR(YEAR(Calculator!C463),\"\")","v":""},{"$f":"IFERROR(VLOOKUP(MONTH(Calculator!C463),'Month mapping'!A:B,2,0),\"\")","v":""},{"$f":"Calculator!D463","v":""},{"$f":"Calculator!E463","v":""},{"$f":"Calculator!G463","v":""},{"$f":"Calculator!H463","v":""},{"$f":"Calculator!I463","v":""},{"$f":"Calculator!J463","v":""}]
[{"$f":"IFERROR(YEAR(Calculator!C464),\"\")","v":""},{"$f":"IFERROR(VLOOKUP(MONTH(Calculator!C464),'Month mapping'!A:B,2,0),\"\")","v":""},{"$f":"Calculator!D464","v":""},{"$f":"Calculator!E464","v":""},{"$f":"Calculator!G464","v":""},{"$f":"Calculator!H464","v":""},{"$f":"Calculator!I464","v":""},{"$f":"Calculator!J464","v":""}]
[{"$f":"IFERROR(YEAR(Calculator!C465),\"\")","v":""},{"$f":"IFERROR(VLOOKUP(MONTH(Calculator!C465),'Month mapping'!A:B,2,0),\"\")","v":""},{"$f":"Calculator!D465","v":""},{"$f":"Calculator!E465","v":""},{"$f":"Calculator!G465","v":""},{"$f":"Calculator!H465","v":""},{"$f":"Calculator!I465","v":""},{"$f":"Calculator!J465","v":""}]
[{"$f":"IFERROR(YEAR(Calculator!C466),\"\")","v":""},{"$f":"IFERROR(VLOOKUP(MONTH(Calculator!C466),'Month mapping'!A:B,2,0),\"\")","v":""},{"$f":"Calculator!D466","v":""},{"$f":"Calculator!E466","v":""},{"$f":"Calculator!G466","v":""},{"$f":"Calculator!H466","v":""},{"$f":"Calculator!I466","v":""},{"$f":"Calculator!J466","v":""}]
[{"$f":"IFERROR(YEAR(Calculator!C467),\"\")","v":""},{"$f":"IFERROR(VLOOKUP(MONTH(Calculator!C467),'Month mapping'!A:B,2,0),\"\")","v":""},{"$f":"Calculator!D467","v":""},{"$f":"Calculator!E467","v":""},{"$f":"Calculator!G467","v":""},{"$f":"Calculator!H467","v":""},{"$f":"Calculator!I467","v":""},{"$f":"Calculator!J467","v":""}]
[{"$f":"IFERROR(YEAR(Calculator!C468),\"\")","v":""},{"$f":"IFERROR(VLOOKUP(MONTH(Calculator!C468),'Month mapping'!A:B,2,0),\"\")","v":""},{"$f":"Calculator!D468","v":""},{"$f":"Calculator!E468","v":""},{"$f":"Calculator!G468","v":""},{"$f":"Calculator!H468","v":""},{"$f":"Calculator!I468","v":""},{"$f":"Calculator!J468","v":""}]
[{"$f":"IFERROR(YEAR(Calculator!C469),\"\")","v":""},{"$f":"IFERROR(VLOOKUP(MONTH(Calculator!C469),'Month mapping'!A:B,2,0),\"\")","v":""},{"$f":"Calculator!D469","v":""},{"$f":"Calculator!E469","v":""},{"$f":"Calculator!G469","v":""},{"$f":"Calculator!H469","v":""},{"$f":"Calculator!I469","v":""},{"$f":"Calculator!J469","v":""}]
[{"$f":"IFERROR(YEAR(Calculator!C470),\"\")","v":""},{"$f":"IFERROR(VLOOKUP(MONTH(Calculator!C470),'Month mapping'!A:B,2,0),\"\")","v":""},{"$f":"Calculator!D470","v":""},{"$f":"Calculator!E470","v":""},{"$f":"Calculator!G470","v":""},{"$f":"Calculator!H470","v":""},{"$f":"Calculator!I470","v":""},{"$f":"Calculator!J470","v":""}]
[{"$f":"IFERROR(YEAR(Calculator!C471),\"\")","v":""},{"$f":"IFERROR(VLOOKUP(MONTH(Calculator!C471),'Month mapping'!A:B,2,0),\"\")","v":""},{"$f":"Calculator!D471","v":""},{"$f":"Calculator!E471","v":""},{"$f":"Calculator!G471","v":""},{"$f":"Calculator!H471","v":""},{"$f":"Calculator!I471","v":""},{"$f":"Calculator!J471","v":""}]
[{"$f":"IFERROR(YEAR(Calculator!C472),\"\")","v":""},{"$f":"IFERROR(VLOOKUP(MONTH(Calculator!C472),'Month mapping'!A:B,2,0),\"\")","v":""},{"$f":"Calculator!D472","v":""},{"$f":"Calculator!E472","v":""},{"$f":"Calculator!G472","v":""},{"$f":"Calculator!H472","v":""},{"$f":"Calculator!I472","v":""},{"$f":"Calculator!J472","v":""}]
[{"$f":"IFERROR(YEAR(Calculator!C473),\"\")","v":""},{"$f":"IFERROR(VLOOKUP(MONTH(Calculator!C473),'Month mapping'!A:B,2,0),\"\")","v":""},{"$f":"Calculator!D473","v":""},{"$f":"Calculator!E473","v":""},{"$f":"Calculator!G473","v":""},{"$f":"Calculator!H473","v":""},{"$f":"Calculator!I473","v":""},{"$f":"Calculator!J473","v":""}]
[{"$f":"IFERROR(YEAR(Calculator!C474),\"\")","v":""},{"$f":"IFERROR(VLOOKUP(MONTH(Calculator!C474),'Month mapping'!A:B,2,0),\"\")","v":""},{"$f":"Calculator!D474","v":""},{"$f":"Calculator!E474","v":""},{"$f":"Calculator!G474","v":""},{"$f":"Calculator!H474","v":""},{"$f":"Calculator!I474","v":""},{"$f":"Calculator!J474","v":""}]
[{"$f":"IFERROR(YEAR(Calculator!C475),\"\")","v":""},{"$f":"IFERROR(VLOOKUP(MONTH(Calculator!C475),'Month mapping'!A:B,2,0),\"\")","v":""},{"$f":"Calculator!D475","v":""},{"$f":"Calculator!E475","v":""},{"$f":"Calculator!G475","v":""},{"$f":"Calculator!H475","v":""},{"$f":"Calculator!I475","v":""},{"$f":"Calculator!J475","v":""}]
[{"$f":"IFERROR(YEAR(Calculator!C476),\"\")","v":""},{"$f":"IFERROR(VLOOKUP(MONTH(Calculator!C476),'Month mapping'!A:B,2,0),\"\")","v":""},{"$f":"Calculator!D476","v":""},{"$f":"Calculator!E476","v":""},{"$f":"Calculator!G476","v":""},{"$f":"Calculator!H476","v":""},{"$f":"Calculator!I476","v":""},{"$f":"Calculator!J476","v":""}]
[{"$f":"IFERROR(YEAR(Calculator!C477),\"\")","v":""},{"$f":"IFERROR(VLOOKUP(MONTH(Calculator!C477),'Month mapping'!A:B,2,0),\"\")","v":""},{"$f":"Calculator!D477","v":""},{"$f":"Calculator!E477","v":""},{"$f":"Calculator!G477","v":""},{"$f":"Calculator!H477","v":""},{"$f":"Calculator!I477","v":""},{"$f":"Calculator!J477","v":""}]
[{"$f":"IFERROR(YEAR(Calculator!C478),\"\")","v":""},{"$f":"IFERROR(VLOOKUP(MONTH(Calculator!C478),'Month mapping'!A:B,2,0),\"\")","v":""},{"$f":"Calculator!D478","v":""},{"$f":"Calculator!E478","v":""},{"$f":"Calculator!G478","v":""},{"$f":"Calculator!H478","v":""},{"$f":"Calculator!I478","v":""},{"$f":"Calculator!J478","v":""}]
[{"$f":"IFERROR(YEAR(Calculator!C479),\"\")","v":""},{"$f":"IFERROR(VLOOKUP(MONTH(Calculator!C479),'Month mapping'!A:B,2,0),\"\")","v":""},{"$f":"Calculator!D479","v":""},{"$f":"Calculator!E479","v":""},{"$f":"Calculator!G479","v":""},{"$f":"Calculator!H479","v":""},{"$f":"Calculator!I479","v":""},{"$f":"Calculator!J479","v":""}]
[{"$f":"IFERROR(YEAR(Calculator!C480),\"\")","v":""},{"$f":"IFERROR(VLOOKUP(MONTH(Calculator!C480),'Month mapping'!A:B,2,0),\"\")","v":""},{"$f":"Calculator!D480","v":""},{"$f":"Calculator!E480","v":""},{"$f":"Calculator!G480","v":""},{"$f":"Calculator!H480","v":""},{"$f":"Calculator!I480","v":""},{"$f":"Calculator!J480","v":""}]
[{"$f":"IFERROR(YEAR(Calculator!C481),\"\")","v":""},{"$f":"IFERROR(VLOOKUP(MONTH(Calculator!C481),'Month mapping'!A:B,2,0),\"\")","v":""},{"$f":"Calculator!D481","v":""},{"$f":"Calculator!E481","v":""},{"$f":"Calculator!G481","v":""},{"$f":"Calculator!H481","v":""},{"$f":"Calculator!I481","v":""},{"$f":"Calculator!J481","v":""}]
[{"$f":"IFERROR(YEAR(Calculator!C482),\"\")","v":""},{"$f":"IFERROR(VLOOKUP(MONTH(Calculator!C482),'Month mapping'!A:B,2,0),\"\")","v":""},{"$f":"Calculator!D482","v":""},{"$f":"Calculator!E482","v":""},{"$f":"Calculator!G482","v":""},{"$f":"Calculator!H482","v":""},{"$f":"Calculator!I482","v":""},{"$f":"Calculator!J482","v":""}]
[{"$f":"IFERROR(YEAR(Calculator!C483),\"\")","v":""},{"$f":"IFERROR(VLOOKUP(MONTH(Calculator!C483),'Month mapping'!A:B,2,0),\"\")","v":""},{"$f":"Calculator!D483","v":""},{"$f":"Calculator!E483","v":""},{"$f":"Calculator!G483","v":""},{"$f":"Calculator!H483","v":""},{"$f":"Calculator!I483","v":""},{"$f":"Calculator!J483","v":""}]
[{"$f":"IFERROR(YEAR(Calculator!C484),\"\")","v":""},{"$f":"IFERROR(VLOOKUP(MONTH(Calculator!C484),'Month mapping'!A:B,2,0),\"\")","v":""},{"$f":"Calculator!D484","v":""},{"$f":"Calculator!E484","v":""},{"$f":"Calculator!G484","v":""},{"$f":"Calculator!H484","v":""},{"$f":"Calculator!I484","v":""},{"$f":"Calculator!J484","v":""}]
[{"$f":"IFERROR(YEAR(Calculator!C485),\"\")","v":""},{"$f":"IFERROR(VLOOKUP(MONTH(Calculator!C485),'Month mapping'!A:B,2,0),\"\")","v":""},{"$f":"Calculator!D485","v":""},{"$f":"Calculator!E485","v":""},{"$f":"Calculator!G485","v":""},{"$f":"Calculator!H485","v":""},{"$f":"Calculator!I485","v":""},{"$f":"Calculator!J485","v":""}]
[{"$f":"IFERROR(YEAR(Calculator!C486),\"\")","v":""},{"$f":"IFERROR(VLOOKUP(MONTH(Calculator!C486),'Month mapping'!A:B,2,0),\"\")","v":""},{"$f":"Calculator!D486","v":""},{"$f":"Calculator!E486","v":""},{"$f":"Calculator!G486","v":""},{"$f":"Calculator!H486","v":""},{"$f":"Calculator!I486","v":""},{"$f":"Calculator!J486","v":""}]
[{"$f":"IFERROR(YEAR(Calculator!C487),\"\")","v":""},{"$f":"IFERROR(VLOOKUP(MONTH(Calculator!C487),'Month mapping'!A:B,2,0),\"\")","v":""},{"$f":"Calculator!D487","v":""},{"$f":"Calculator!E487","v":""},{"$f":"Calculator!G487","v":""},{"$f":"Calculator!H487","v":""},{"$f":"Calculator!I487","v":""},{"$f":"Calculator!J487","v":""}]
[{"$f":"IFERROR(YEAR(Calculator!C488),\"\")","v":""},{"$f":"IFERROR(VLOOKUP(MONTH(Calculator!C488),'Month mapping'!A:B,2,0),\"\")","v":""},{"$f":"Calculator!D488","v":""},{"$f":"Calculator!E488","v":""},{"$f":"Calculator!G488","v":""},{"$f":"Calculator!H488","v":""},{"$f":"Calculator!I488","v":""},{"$f":"Calculator!J488","v":""}]
[{"$f":"IFERROR(YEAR(Calculator!C489),\"\")","v":""},{"$f":"IFERROR(VLOOKUP(MONTH(Calculator!C489),'Month mapping'!A:B,2,0),\"\")","v":""},{"$f":"Calculator!D489","v":""},{"$f":"Calculator!E489","v":""},{"$f":"Calculator!G489","v":""},{"$f":"Calculator!H489","v":""},{"$f":"Calculator!I489","v":""},{"$f":"Calculator!J489","v":""}]
[{"$f":"IFERROR(YEAR(Calculator!C490),\"\")","v":""},{"$f":"IFERROR(VLOOKUP(MONTH(Calculator!C490),'Month mapping'!A:B,2,0),\"\")","v":""},{"$f":"Calculator!D490","v":""},{"$f":"Calculator!E490","v":""},{"$f":"Calculator!G490","v":""},{"$f":"Calculator!H490","v":""},{"$f":"Calculator!I490","v":""},{"$f":"Calculator!J490","v":""}]
[{"$f":"IFERROR(YEAR(Calculator!C491),\"\")","v":""},{"$f":"IFERROR(VLOOKUP(MONTH(Calculator!C491),'Month mapping'!A:B,2,0),\"\")","v":""},{"$f":"Calculator!D491","v":""},{"$f":"Calculator!E491","v":""},{"$f":"Calculator!G491","v":""},{"$f":"Calculator!H491","v":""},{"$f":"Calculator!I491","v":""},{"$f":"Calculator!J491","v":""}]
[{"$f":"IFERROR(YEAR(Calculator!C492),\"\")","v":""},{"$f":"IFERROR(VLOOKUP(MONTH(Calculator!C492),'Month mapping'!A:B,2,0),\"\")","v":""},{"$f":"Calculator!D492","v":""},{"$f":"Calculator!E492","v":""},{"$f":"Calculator!G492","v":""},{"$f":"Calculator!H492","v":""},{"$f":"Calculator!I492","v":""},{"$f":"Calculator!J492","v":""}]
[{"$f":"IFERROR(YEAR(Calculator!C493),\"\")","v":""},{"$f":"IFERROR(VLOOKUP(MONTH(Calculator!C493),'Month mapping'!A:B,2,0),\"\")","v":""},{"$f":"Calculator!D493","v":""},{"$f":"Calculator!E493","v":""},{"$f":"Calculator!G493","v":""},{"$f":"Calculator!H493","v":""},{"$f":"Calculator!I493","v":""},{"$f":"Calculator!J493","v":""}]
[{"$f":"IFERROR(YEAR(Calculator!C494),\"\")","v":""},{"$f":"IFERROR(VLOOKUP(MONTH(Calculator!C494),'Month mapping'!A:B,2,0),\"\")","v":""},{"$f":"Calculator!D494","v":""},{"$f":"Calculator!E494","v":""},{"$f":"Calculator!G494","v":""},{"$f":"Calculator!H494","v":""},{"$f":"Calculator!I494","v":""},{"$f":"Calculator!J494","v":""}]
[{"$f":"IFERROR(YEAR(Calculator!C495),\"\")","v":""},{"$f":"IFERROR(VLOOKUP(MONTH(Calculator!C495),'Month mapping'!A:B,2,0),\"\")","v":""},{"$f":"Calculator!D495","v":""},{"$f":"Calculator!E495","v":""},{"$f":"Calculator!G495","v":""},{"$f":"Calculator!H495","v":""},{"$f":"Calculator!I495","v":""},{"$f":"Calculator!J495","v":""}]
[{"$f":"IFERROR(YEAR(Calculator!C496),\"\")","v":""},{"$f":"IFERROR(VLOOKUP(MONTH(Calculator!C496),'Month mapping'!A:B,2,0),\"\")","v":""},{"$f":"Calculator!D496","v":""},{"$f":"Calculator!E496","v":""},{"$f":"Calculator!G496","v":""},{"$f":"Calculator!H496","v":""},{"$f":"Calculator!I496","v":""},{"$f":"Calculator!J496","v":""}]
[{"$f":"IFERROR(YEAR(Calculator!C497),\"\")","v":""},{"$f":"IFERROR(VLOOKUP(MONTH(Calculator!C497),'Month mapping'!A:B,2,0),\"\")","v":""},{"$f":"Calculator!D497","v":""},{"$f":"Calculator!E497","v":""},{"$f":"Calculator!G497","v":""},{"$f":"Calculator!H497","v":""},{"$f":"Calculator!I497","v":""},{"$f":"Calculator!J497","v":""}]
[{"$f":"IFERROR(YEAR(Calculator!C498),\"\")","v":""},{"$f":"IFERROR(VLOOKUP(MONTH(Calculator!C498),'Month mapping'!A:B,2,0),\"\")","v":""},{"$f":"Calculator!D498","v":""},{"$f":"Calculator!E498","v":""},{"$f":"Calculator!G498","v":""},{"$f":"Calculator!H498","v":""},{"$f":"Calculator!I498","v":""},{"$f":"Calculator!J498","v":""}]
[{"$f":"IFERROR(YEAR(Calculator!C499),\"\")","v":""},{"$f":"IFERROR(VLOOKUP(MONTH(Calculator!C499),'Month mapping'!A:B,2,0),\"\")","v":""},{"$f":"Calculator!D499","v":""},{"$f":"Calculator!E499","v":""},{"$f":"Calculator!G499","v":""},{"$f":"Calculator!H499","v":""},{"$f":"Calculator!I499","v":""},{"$f":"Calculator!J499","v":""}]
[{"$f":"IFERROR(YEAR(Calculator!C500),\"\")","v":""},{"$f":"IFERROR(VLOOKUP(MONTH(Calculator!C500),'Month mapping'!A:B,2,0),\"\")","v":""},{"$f":"Calculator!D500","v":""},{"$f":"Calculator!E500","v":""},{"$f":"Calculator!G500","v":""},{"$f":"Calculator!H500","v":""},{"$f":"Calculator!I500","v":""},{"$f":"Calculator!J500","v":""}]
[{"$f":"IFERROR(YEAR(Calculator!C501),\"\")","v":""},{"$f":"IFERROR(VLOOKUP(MONTH(Calculator!C501),'Month mapping'!A:B,2,0),\"\")","v":""},{"$f":"Calculator!D501","v":""},{"$f":"Calculator!E501","v":""},{"$f":"Calculator!G501","v":""},{"$f":"Calculator!H501","v":""},{"$f":"Calculator!I501","v":""},{"$f":"Calculator!J501","v":""}]
[{"$f":"IFERROR(YEAR(Calculator!C502),\"\")","v":""},{"$f":"IFERROR(VLOOKUP(MONTH(Calculator!C502),'Month mapping'!A:B,2,0),\"\")","v":""},{"$f":"Calculator!D502","v":""},{"$f":"Calculator!E502","v":""},{"$f":"Calculator!G502","v":""},{"$f":"Calculator!H502","v":""},{"$f":"Calculator!I502","v":""},{"$f":"Calculator!J502","v":""}]
[{"$f":"IFERROR(YEAR(Calculator!C503),\"\")","v":""},{"$f":"IFERROR(VLOOKUP(MONTH(Calculator!C503),'Month mapping'!A:B,2,0),\"\")","v":""},{"$f":"Calculator!D503","v":""},{"$f":"Calculator!E503","v":""},{"$f":"Calculator!G503","v":""},{"$f":"Calculator!H503","v":""},{"$f":"Calculator!I503","v":""},{"$f":"Calculator!J503","v":""}]
[{"$f":"IFERROR(YEAR(Calculator!C504),\"\")","v":""},{"$f":"IFERROR(VLOOKUP(MONTH(Calculator!C504),'Month mapping'!A:B,2,0),\"\")","v":""},{"$f":"Calculator!D504","v":""},{"$f":"Calculator!E504","v":""},{"$f":"Calculator!G504","v":""},{"$f":"Calculator!H504","v":""},{"$f":"Calculator!I504","v":""},{"$f":"Calculator!J504","v":""}]
[{"$f":"IFERROR(YEAR(Calculator!C505),\"\")","v":""},{"$f":"IFERROR(VLOOKUP(MONTH(Calculator!C505),'Month mapping'!A:B,2,0),\"\")","v":""},{"$f":"Calculator!D505","v":""},{"$f":"Calculator!E505","v":""},{"$f":"Calculator!G505","v":""},{"$f":"Calculator!H505","v":""},{"$f":"Calculator!I505","v":""},{"$f":"Calculator!J505","v":""}]
[{"$f":"IFERROR(YEAR(Calculator!C506),\"\")","v":""},{"$f":"IFERROR(VLOOKUP(MONTH(Calculator!C506),'Month mapping'!A:B,2,0),\"\")","v":""},{"$f":"Calculator!D506","v":""},{"$f":"Calculator!E506","v":""},{"$f":"Calculator!G506","v":""},{"$f":"Calculator!H506","v":""},{"$f":"Calculator!I506","v":""},{"$f":"Calculator!J506","v":""}]
[{"$f":"IFERROR(YEAR(Calculator!C507),\"\")","v":""},{"$f":"IFERROR(VLOOKUP(MONTH(Calculator!C507),'Month mapping'!A:B,2,0),\"\")","v":""},{"$f":"Calculator!D507","v":""},{"$f":"Calculator!E507","v":""},{"$f":"Calculator!G507","v":""},{"$f":"Calculator!H507","v":""},{"$f":"Calculator!I507","v":""},{"$f":"Calculator!J507","v":""}]
[{"$f":"IFERROR(YEAR(Calculator!C508),\"\")","v":""},{"$f":"IFERROR(VLOOKUP(MONTH(Calculator!C508),'Month mapping'!A:B,2,0),\"\")","v":""},{"$f":"Calculator!D508","v":""},{"$f":"Calculator!E508","v":""},{"$f":"Calculator!G508","v":""},{"$f":"Calculator!H508","v":""},{"$f":"Calculator!I508","v":""},{"$f":"Calculator!J508","v":""}]
[{"$f":"IFERROR(YEAR(Calculator!C509),\"\")","v":""},{"$f":"IFERROR(VLOOKUP(MONTH(Calculator!C509),'Month mapping'!A:B,2,0),\"\")","v":""},{"$f":"Calculator!D509","v":""},{"$f":"Calculator!E509","v":""},{"$f":"Calculator!G509","v":""},{"$f":"Calculator!H509","v":""},{"$f":"Calculator!I509","v":""},{"$f":"Calculator!J509","v":""}]
[{"$f":"IFERROR(YEAR(Calculator!C510),\"\")","v":""},{"$f":"IFERROR(VLOOKUP(MONTH(Calculator!C510),'Month mapping'!A:B,2,0),\"\")","v":""},{"$f":"Calculator!D510","v":""},{"$f":"Calculator!E510","v":""},{"$f":"Calculator!G510","v":""},{"$f":"Calculator!H510","v":""},{"$f":"Calculator!I510","v":""},{"$f":"Calculator!J510","v":""}]
[{"$f":"IFERROR(YEAR(Calculator!C511),\"\")","v":""},{"$f":"IFERROR(VLOOKUP(MONTH(Calculator!C511),'Month mapping'!A:B,2,0),\"\")","v":""},{"$f":"Calculator!D511","v":""},{"$f":"Calculator!E511","v":""},{"$f":"Calculator!G511","v":""},{"$f":"Calculator!H511","v":""},{"$f":"Calculator!I511","v":""},{"$f":"Calculator!J511","v":""}]
[{"$f":"IFERROR(YEAR(Calculator!C512),\"\")","v":""},{"$f":"IFERROR(VLOOKUP(MONTH(Calculator!C512),'Month mapping'!A:B,2,0),\"\")","v":""},{"$f":"Calculator!D512","v":""},{"$f":"Calculator!E512","v":""},{"$f":"Calculator!G512","v":""},{"$f":"Calculator!H512","v":""},{"$f":"Calculator!I512","v":""},{"$f":"Calculator!J512","v":""}]
[{"$f":"IFERROR(YEAR(Calculator!C513),\"\")","v":""},{"$f":"IFERROR(VLOOKUP(MONTH(Calculator!C513),'Month mapping'!A:B,2,0),\"\")","v":""},{"$f":"Calculator!D513","v":""},{"$f":"Calculator!E513","v":""},{"$f":"Calculator!G513","v":""},{"$f":"Calculator!H513","v":""},{"$f":"Calculator!I513","v":""},{"$f":"Calculator!J513","v":""}]
[{"$f":"IFERROR(YEAR(Calculator!C514),\"\")","v":""},{"$f":"IFERROR(VLOOKUP(MONTH(Calculator!C514),'Month mapping'!A:B,2,0),\"\")","v":""},{"$f":"Calculator!D514","v":""},{"$f":"Calculator!E514","v":""},{"$f":"Calculator!G514","v":""},{"$f":"Calculator!H514","v":""},{"$f":"Calculator!I514","v":""},{"$f":"Calculator!J514","v":""}]
[{"$f":"IFERROR(YEAR(Calculator!C515),\"\")","v":""},{"$f":"IFERROR(VLOOKUP(MONTH(Calculator!C515),'Month mapping'!A:B,2,0),\"\")","v":""},{"$f":"Calculator!D515","v":""},{"$f":"Calculator!E515","v":""},{"$f":"Calculator!G515","v":""},{"$f":"Calculator!H515","v":""},{"$f":"Calculator!I515","v":""},{"$f":"Calculator!J515","v":""}]
[{"$f":"IFERROR(YEAR(Calculator!C516),\"\")","v":""},{"$f":"IFERROR(VLOOKUP(MONTH(Calculator!C516),'Month mapping'!A:B,2,0),\"\")","v":""},{"$f":"Calculator!D516","v":""},{"$f":"Calculator!E516","v":""},{"$f":"Calculator!G516","v":""},{"$f":"Calculator!H516","v":""},{"$f":"Calculator!I516","v":""},{"$f":"Calculator!J516","v":""}]
[{"$f":"IFERROR(YEAR(Calculator!C517),\"\")","v":""},{"$f":"IFERROR(VLOOKUP(MONTH(Calculator!C517),'Month mapping'!A:B,2,0),\"\")","v":""},{"$f":"Calculator!D517","v":""},{"$f":"Calculator!E517","v":""},{"$f":"Calculator!G517","v":""},{"$f":"Calculator!H517","v":""},{"$f":"Calculator!I517","v":""},{"$f":"Calculator!J517","v":""}]
[{"$f":"IFERROR(YEAR(Calculator!C518),\"\")","v":""},{"$f":"IFERROR(VLOOKUP(MONTH(Calculator!C518),'Month mapping'!A:B,2,0),\"\")","v":""},{"$f":"Calculator!D518","v":""},{"$f":"Calculator!E518","v":""},{"$f":"Calculator!G518","v":""},{"$f":"Calculator!H518","v":""},{"$f":"Calculator!I518","v":""},{"$f":"Calculator!J518","v":""}]
[{"$f":"IFERROR(YEAR(Calculator!C519),\"\")","v":""},{"$f":"IFERROR(VLOOKUP(MONTH(Calculator!C519),'Month mapping'!A:B,2,0),\"\")","v":""},{"$f":"Calculator!D519","v":""},{"$f":"Calculator!E519","v":""},{"$f":"Calculator!G519","v":""},{"$f":"Calculator!H519","v":""},{"$f":"Calculator!I519","v":""},{"$f":"Calculator!J519","v":""}]
[{"$f":"IFERROR(YEAR(Calculator!C520),\"\")","v":""},{"$f":"IFERROR(VLOOKUP(MONTH(Calculator!C520),'Month mapping'!A:B,2,0),\"\")","v":""},{"$f":"Calculator!D520","v":""},{"$f":"Calculator!E520","v":""},{"$f":"Calculator!G520","v":""},{"$f":"Calculator!H520","v":""},{"$f":"Calculator!I520","v":""},{"$f":"Calculator!J520","v":""}]
[{"$f":"IFERROR(YEAR(Calculator!C521),\"\")","v":""},{"$f":"IFERROR(VLOOKUP(MONTH(Calculator!C521),'Month mapping'!A:B,2,0),\"\")","v":""},{"$f":"Calculator!D521","v":""},{"$f":"Calculator!E521","v":""},{"$f":"Calculator!G521","v":""},{"$f":"Calculator!H521","v":""},{"$f":"Calculator!I521","v":""},{"$f":"Calculator!J521","v":""}]
[{"$f":"IFERROR(YEAR(Calculator!C522),\"\")","v":""},{"$f":"IFERROR(VLOOKUP(MONTH(Calculator!C522),'Month mapping'!A:B,2,0),\"\")","v":""},{"$f":"Calculator!D522","v":""},{"$f":"Calculator!E522","v":""},{"$f":"Calculator!G522","v":""},{"$f":"Calculator!H522","v":""},{"$f":"Calculator!I522","v":""},{"$f":"Calculator!J522","v":""}]
[{"$f":"IFERROR(YEAR(Calculator!C523),\"\")","v":""},{"$f":"IFERROR(VLOOKUP(MONTH(Calculator!C523),'Month mapping'!A:B,2,0),\"\")","v":""},{"$f":"Calculator!D523","v":""},{"$f":"Calculator!E523","v":""},{"$f":"Calculator!G523","v":""},{"$f":"Calculator!H523","v":""},{"$f":"Calculator!I523","v":""},{"$f":"Calculator!J523","v":""}]
[{"$f":"IFERROR(YEAR(Calculator!C524),\"\")","v":""},{"$f":"IFERROR(VLOOKUP(MONTH(Calculator!C524),'Month mapping'!A:B,2,0),\"\")","v":""},{"$f":"Calculator!D524","v":""},{"$f":"Calculator!E524","v":""},{"$f":"Calculator!G524","v":""},{"$f":"Calculator!H524","v":""},{"$f":"Calculator!I524","v":""},{"$f":"Calculator!J524","v":""}]
[{"$f":"IFERROR(YEAR(Calculator!C525),\"\")","v":""},{"$f":"IFERROR(VLOOKUP(MONTH(Calculator!C525),'Month mapping'!A:B,2,0),\"\")","v":""},{"$f":"Calculator!D525","v":""},{"$f":"Calculator!E525","v":""},{"$f":"Calculator!G525","v":""},{"$f":"Calculator!H525","v":""},{"$f":"Calculator!I525","v":""},{"$f":"Calculator!J525","v":""}]
[{"$f":"IFERROR(YEAR(Calculator!C526),\"\")","v":""},{"$f":"IFERROR(VLOOKUP(MONTH(Calculator!C526),'Month mapping'!A:B,2,0),\"\")","v":""},{"$f":"Calculator!D526","v":""},{"$f":"Calculator!E526","v":""},{"$f":"Calculator!G526","v":""},{"$f":"Calculator!H526","v":""},{"$f":"Calculator!I526","v":""},{"$f":"Calculator!J526","v":""}]
[{"$f":"IFERROR(YEAR(Calculator!C527),\"\")","v":""},{"$f":"IFERROR(VLOOKUP(MONTH(Calculator!C527),'Month mapping'!A:B,2,0),\"\")","v":""},{"$f":"Calculator!D527","v":""},{"$f":"Calculator!E527","v":""},{"$f":"Calculator!G527","v":""},{"$f":"Calculator!H527","v":""},{"$f":"Calculator!I527","v":""},{"$f":"Calculator!J527","v":""}]
[{"$f":"IFERROR(YEAR(Calculator!C528),\"\")","v":""},{"$f":"IFERROR(VLOOKUP(MONTH(Calculator!C528),'Month mapping'!A:B,2,0),\"\")","v":""},{"$f":"Calculator!D528","v":""},{"$f":"Calculator!E528","v":""},{"$f":"Calculator!G528","v":""},{"$f":"Calculator!H528","v":""},{"$f":"Calculator!I528","v":""},{"$f":"Calculator!J528","v":""}]
[{"$f":"IFERROR(YEAR(Calculator!C529),\"\")","v":""},{"$f":"IFERROR(VLOOKUP(MONTH(Calculator!C529),'Month mapping'!A:B,2,0),\"\")","v":""},{"$f":"Calculator!D529","v":""},{"$f":"Calculator!E529","v":""},{"$f":"Calculator!G529","v":""},{"$f":"Calculator!H529","v":""},{"$f":"Calculator!I529","v":""},{"$f":"Calculator!J529","v":""}]
[{"$f":"IFERROR(YEAR(Calculator!C530),\"\")","v":""},{"$f":"IFERROR(VLOOKUP(MONTH(Calculator!C530),'Month mapping'!A:B,2,0),\"\")","v":""},{"$f":"Calculator!D530","v":""},{"$f":"Calculator!E530","v":""},{"$f":"Calculator!G530","v":""},{"$f":"Calculator!H530","v":""},{"$f":"Calculator!I530","v":""},{"$f":"Calculator!J530","v":""}]
[{"$f":"IFERROR(YEAR(Calculator!C531),\"\")","v":""},{"$f":"IFERROR(VLOOKUP(MONTH(Calculator!C531),'Month mapping'!A:B,2,0),\"\")","v":""},{"$f":"Calculator!D531","v":""},{"$f":"Calculator!E531","v":""},{"$f":"Calculator!G531","v":""},{"$f":"Calculator!H531","v":""},{"$f":"Calculator!I531","v":""},{"$f":"Calculator!J531","v":""}]
[{"$f":"IFERROR(YEAR(Calculator!C532),\"\")","v":""},{"$f":"IFERROR(VLOOKUP(MONTH(Calculator!C532),'Month mapping'!A:B,2,0),\"\")","v":""},{"$f":"Calculator!D532","v":""},{"$f":"Calculator!E532","v":""},{"$f":"Calculator!G532","v":""},{"$f":"Calculator!H532","v":""},{"$f":"Calculator!I532","v":""},{"$f":"Calculator!J532","v":""}]
[{"$f":"IFERROR(YEAR(Calculator!C533),\"\")","v":""},{"$f":"IFERROR(VLOOKUP(MONTH(Calculator!C533),'Month mapping'!A:B,2,0),\"\")","v":""},{"$f":"Calculator!D533","v":""},{"$f":"Calculator!E533","v":""},{"$f":"Calculator!G533","v":""},{"$f":"Calculator!H533","v":""},{"$f":"Calculator!I533","v":""},{"$f":"Calculator!J533","v":""}]
[{"$f":"IFERROR(YEAR(Calculator!C534),\"\")","v":""},{"$f":"IFERROR(VLOOKUP(MONTH(Calculator!C534),'Month mapping'!A:B,2,0),\"\")","v":""},{"$f":"Calculator!D534","v":""},{"$f":"Calculator!E534","v":""},{"$f":"Calculator!G534","v":""},{"$f":"Calculator!H534","v":""},{"$f":"Calculator!I534","v":""},{"$f":"Calculator!J534","v":""}]
[{"$f":"IFERROR(YEAR(Calculator!C535),\"\")","v":""},{"$f":"IFERROR(VLOOKUP(MONTH(Calculator!C535),'Month mapping'!A:B,2,0),\"\")","v":""},{"$f":"Calculator!D535","v":""},{"$f":"Calculator!E535","v":""},{"$f":"Calculator!G535","v":""},{"$f":"Calculator!H535","v":""},{"$f":"Calculator!I535","v":""},{"$f":"Calculator!J535","v":""}]
[{"$f":"IFERROR(YEAR(Calculator!C536),\"\")","v":""},{"$f":"IFERROR(VLOOKUP(MONTH(Calculator!C536),'Month mapping'!A:B,2,0),\"\")","v":""},{"$f":"Calculator!D536","v":""},{"$f":"Calculator!E536","v":""},{"$f":"Calculator!G536","v":""},{"$f":"Calculator!H536","v":""},{"$f":"Calculator!I536","v":""},{"$f":"Calculator!J536","v":""}]
[{"$f":"IFERROR(YEAR(Calculator!C537),\"\")","v":""},{"$f":"IFERROR(VLOOKUP(MONTH(Calculator!C537),'Month mapping'!A:B,2,0),\"\")","v":""},{"$f":"Calculator!D537","v":""},{"$f":"Calculator!E537","v":""},{"$f":"Calculator!G537","v":""},{"$f":"Calculator!H537","v":""},{"$f":"Calculator!I537","v":""},{"$f":"Calculator!J537","v":""}]
[{"$f":"IFERROR(YEAR(Calculator!C538),\"\")","v":""},{"$f":"IFERROR(VLOOKUP(MONTH(Calculator!C538),'Month mapping'!A:B,2,0),\"\")","v":""},{"$f":"Calculator!D538","v":""},{"$f":"Calculator!E538","v":""},{"$f":"Calculator!G538","v":""},{"$f":"Calculator!H538","v":""},{"$f":"Calculator!I538","v":""},{"$f":"Calculator!J538","v":""}]
[{"$f":"IFERROR(YEAR(Calculator!C539),\"\")","v":""},{"$f":"IFERROR(VLOOKUP(MONTH(Calculator!C539),'Month mapping'!A:B,2,0),\"\")","v":""},{"$f":"Calculator!D539","v":""},{"$f":"Calculator!E539","v":""},{"$f":"Calculator!G539","v":""},{"$f":"Calculator!H539","v":""},{"$f":"Calculator!I539","v":""},{"$f":"Calculator!J539","v":""}]
[{"$f":"IFERROR(YEAR(Calculator!C540),\"\")","v":""},{"$f":"IFERROR(VLOOKUP(MONTH(Calculator!C540),'Month mapping'!A:B,2,0),\"\")","v":""},{"$f":"Calculator!D540","v":""},{"$f":"Calculator!E540","v":""},{"$f":"Calculator!G540","v":""},{"$f":"Calculator!H540","v":""},{"$f":"Calculator!I540","v":""},{"$f":"Calculator!J540","v":""}]
[{"$f":"IFERROR(YEAR(Calculator!C541),\"\")","v":""},{"$f":"IFERROR(VLOOKUP(MONTH(Calculator!C541),'Month mapping'!A:B,2,0),\"\")","v":""},{"$f":"Calculator!D541","v":""},{"$f":"Calculator!E541","v":""},{"$f":"Calculator!G541","v":""},{"$f":"Calculator!H541","v":""},{"$f":"Calculator!I541","v":""},{"$f":"Calculator!J541","v":""}]
[{"$f":"IFERROR(YEAR(Calculator!C542),\"\")","v":""},{"$f":"IFERROR(VLOOKUP(MONTH(Calculator!C542),'Month mapping'!A:B,2,0),\"\")","v":""},{"$f":"Calculator!D542","v":""},{"$f":"Calculator!E542","v":""},{"$f":"Calculator!G542","v":""},{"$f":"Calculator!H542","v":""},{"$f":"Calculator!I542","v":""},{"$f":"Calculator!J542","v":""}]
[{"$f":"IFERROR(YEAR(Calculator!C543),\"\")","v":""},{"$f":"IFERROR(VLOOKUP(MONTH(Calculator!C543),'Month mapping'!A:B,2,0),\"\")","v":""},{"$f":"Calculator!D543","v":""},{"$f":"Calculator!E543","v":""},{"$f":"Calculator!G543","v":""},{"$f":"Calculator!H543","v":""},{"$f":"Calculator!I543","v":""},{"$f":"Calculator!J543","v":""}]
[{"$f":"IFERROR(YEAR(Calculator!C544),\"\")","v":""},{"$f":"IFERROR(VLOOKUP(MONTH(Calculator!C544),'Month mapping'!A:B,2,0),\"\")","v":""},{"$f":"Calculator!D544","v":""},{"$f":"Calculator!E544","v":""},{"$f":"Calculator!G544","v":""},{"$f":"Calculator!H544","v":""},{"$f":"Calculator!I544","v":""},{"$f":"Calculator!J544","v":""}]
[{"$f":"IFERROR(YEAR(Calculator!C545),\"\")","v":""},{"$f":"IFERROR(VLOOKUP(MONTH(Calculator!C545),'Month mapping'!A:B,2,0),\"\")","v":""},{"$f":"Calculator!D545","v":""},{"$f":"Calculator!E545","v":""},{"$f":"Calculator!G545","v":""},{"$f":"Calculator!H545","v":""},{"$f":"Calculator!I545","v":""},{"$f":"Calculator!J545","v":""}]
[{"$f":"IFERROR(YEAR(Calculator!C546),\"\")","v":""},{"$f":"IFERROR(VLOOKUP(MONTH(Calculator!C546),'Month mapping'!A:B,2,0),\"\")","v":""},{"$f":"Calculator!D546","v":""},{"$f":"Calculator!E546","v":""},{"$f":"Calculator!G546","v":""},{"$f":"Calculator!H546","v":""},{"$f":"Calculator!I546","v":""},{"$f":"Calculator!J546","v":""}]
[{"$f":"IFERROR(YEAR(Calculator!C547),\"\")","v":""},{"$f":"IFERROR(VLOOKUP(MONTH(Calculator!C547),'Month mapping'!A:B,2,0),\"\")","v":""},{"$f":"Calculator!D547","v":""},{"$f":"Calculator!E547","v":""},{"$f":"Calculator!G547","v":""},{"$f":"Calculator!H547","v":""},{"$f":"Calculator!I547","v":""},{"$f":"Calculator!J547","v":""}]
[{"$f":"IFERROR(YEAR(Calculator!C548),\"\")","v":""},{"$f":"IFERROR(VLOOKUP(MONTH(Calculator!C548),'Month mapping'!A:B,2,0),\"\")","v":""},{"$f":"Calculator!D548","v":""},{"$f":"Calculator!E548","v":""},{"$f":"Calculator!G548","v":""},{"$f":"Calculator!H548","v":""},{"$f":"Calculator!I548","v":""},{"$f":"Calculator!J548","v":""}]
[{"$f":"IFERROR(YEAR(Calculator!C549),\"\")","v":""},{"$f":"IFERROR(VLOOKUP(MONTH(Calculator!C549),'Month mapping'!A:B,2,0),\"\")","v":""},{"$f":"Calculator!D549","v":""},{"$f":"Calculator!E549","v":""},{"$f":"Calculator!G549","v":""},{"$f":"Calculator!H549","v":""},{"$f":"Calculator!I549","v":""},{"$f":"Calculator!J549","v":""}]
[{"$f":"IFERROR(YEAR(Calculator!C550),\"\")","v":""},{"$f":"IFERROR(VLOOKUP(MONTH(Calculator!C550),'Month mapping'!A:B,2,0),\"\")","v":""},{"$f":"Calculator!D550","v":""},{"$f":"Calculator!E550","v":""},{"$f":"Calculator!G550","v":""},{"$f":"Calculator!H550","v":""},{"$f":"Calculator!I550","v":""},{"$f":"Calculator!J550","v":""}]
[{"$f":"IFERROR(YEAR(Calculator!C551),\"\")","v":""},{"$f":"IFERROR(VLOOKUP(MONTH(Calculator!C551),'Month mapping'!A:B,2,0),\"\")","v":""},{"$f":"Calculator!D551","v":""},{"$f":"Calculator!E551","v":""},{"$f":"Calculator!G551","v":""},{"$f":"Calculator!H551","v":""},{"$f":"Calculator!I551","v":""},{"$f":"Calculator!J551","v":""}]
[{"$f":"IFERROR(YEAR(Calculator!C552),\"\")","v":""},{"$f":"IFERROR(VLOOKUP(MONTH(Calculator!C552),'Month mapping'!A:B,2,0),\"\")","v":""},{"$f":"Calculator!D552","v":""},{"$f":"Calculator!E552","v":""},{"$f":"Calculator!G552","v":""},{"$f":"Calculator!H552","v":""},{"$f":"Calculator!I552","v":""},{"$f":"Calculator!J552","v":""}]
[{"$f":"IFERROR(YEAR(Calculator!C553),\"\")","v":""},{"$f":"IFERROR(VLOOKUP(MONTH(Calculator!C553),'Month mapping'!A:B,2,0),\"\")","v":""},{"$f":"Calculator!D553","v":""},{"$f":"Calculator!E553","v":""},{"$f":"Calculator!G553","v":""},{"$f":"Calculator!H553","v":""},{"$f":"Calculator!I553","v":""},{"$f":"Calculator!J553","v":""}]
[{"$f":"IFERROR(YEAR(Calculator!C554),\"\")","v":""},{"$f":"IFERROR(VLOOKUP(MONTH(Calculator!C554),'Month mapping'!A:B,2,0),\"\")","v":""},{"$f":"Calculator!D554","v":""},{"$f":"Calculator!E554","v":""},{"$f":"Calculator!G554","v":""},{"$f":"Calculator!H554","v":""},{"$f":"Calculator!I554","v":""},{"$f":"Calculator!J554","v":""}]
[{"$f":"IFERROR(YEAR(Calculator!C555),\"\")","v":""},{"$f":"IFERROR(VLOOKUP(MONTH(Calculator!C555),'Month mapping'!A:B,2,0),\"\")","v":""},{"$f":"Calculator!D555","v":""},{"$f":"Calculator!E555","v":""},{"$f":"Calculator!G555","v":""},{"$f":"Calculator!H555","v":""},{"$f":"Calculator!I555","v":""},{"$f":"Calculator!J555","v":""}]
[{"$f":"IFERROR(YEAR(Calculator!C556),\"\")","v":""},{"$f":"IFERROR(VLOOKUP(MONTH(Calculator!C556),'Month mapping'!A:B,2,0),\"\")","v":""},{"$f":"Calculator!D556","v":""},{"$f":"Calculator!E556","v":""},{"$f":"Calculator!G556","v":""},{"$f":"Calculator!H556","v":""},{"$f":"Calculator!I556","v":""},{"$f":"Calculator!J556","v":""}]
[{"$f":"IFERROR(YEAR(Calculator!C557),\"\")","v":""},{"$f":"IFERROR(VLOOKUP(MONTH(Calculator!C557),'Month mapping'!A:B,2,0),\"\")","v":""},{"$f":"Calculator!D557","v":""},{"$f":"Calculator!E557","v":""},{"$f":"Calculator!G557","v":""},{"$f":"Calculator!H557","v":""},{"$f":"Calculator!I557","v":""},{"$f":"Calculator!J557","v":""}]
[{"$f":"IFERROR(YEAR(Calculator!C558),\"\")","v":""},{"$f":"IFERROR(VLOOKUP(MONTH(Calculator!C558),'Month mapping'!A:B,2,0),\"\")","v":""},{"$f":"Calculator!D558","v":""},{"$f":"Calculator!E558","v":""},{"$f":"Calculator!G558","v":""},{"$f":"Calculator!H558","v":""},{"$f":"Calculator!I558","v":""},{"$f":"Calculator!J558","v":""}]
[{"$f":"IFERROR(YEAR(Calculator!C559),\"\")","v":""},{"$f":"IFERROR(VLOOKUP(MONTH(Calculator!C559),'Month mapping'!A:B,2,0),\"\")","v":""},{"$f":"Calculator!D559","v":""},{"$f":"Calculator!E559","v":""},{"$f":"Calculator!G559","v":""},{"$f":"Calculator!H559","v":""},{"$f":"Calculator!I559","v":""},{"$f":"Calculator!J559","v":""}]
[{"$f":"IFERROR(YEAR(Calculator!C560),\"\")","v":""},{"$f":"IFERROR(VLOOKUP(MONTH(Calculator!C560),'Month mapping'!A:B,2,0),\"\")","v":""},{"$f":"Calculator!D560","v":""},{"$f":"Calculator!E560","v":""},{"$f":"Calculator!G560","v":""},{"$f":"Calculator!H560","v":""},{"$f":"Calculator!I560","v":""},{"$f":"Calculator!J560","v":""}]
[{"$f":"IFERROR(YEAR(Calculator!C561),\"\")","v":""},{"$f":"IFERROR(VLOOKUP(MONTH(Calculator!C561),'Month mapping'!A:B,2,0),\"\")","v":""},{"$f":"Calculator!D561","v":""},{"$f":"Calculator!E561","v":""},{"$f":"Calculator!G561","v":""},{"$f":"Calculator!H561","v":""},{"$f":"Calculator!I561","v":""},{"$f":"Calculator!J561","v":""}]
[{"$f":"IFERROR(YEAR(Calculator!C562),\"\")","v":""},{"$f":"IFERROR(VLOOKUP(MONTH(Calculator!C562),'Month mapping'!A:B,2,0),\"\")","v":""},{"$f":"Calculator!D562","v":""},{"$f":"Calculator!E562","v":""},{"$f":"Calculator!G562","v":""},{"$f":"Calculator!H562","v":""},{"$f":"Calculator!I562","v":""},{"$f":"Calculator!J562","v":""}]
[{"$f":"IFERROR(YEAR(Calculator!C563),\"\")","v":""},{"$f":"IFERROR(VLOOKUP(MONTH(Calculator!C563),'Month mapping'!A:B,2,0),\"\")","v":""},{"$f":"Calculator!D563","v":""},{"$f":"Calculator!E563","v":""},{"$f":"Calculator!G563","v":""},{"$f":"Calculator!H563","v":""},{"$f":"Calculator!I563","v":""},{"$f":"Calculator!J563","v":""}]
[{"$f":"IFERROR(YEAR(Calculator!C564),\"\")","v":""},{"$f":"IFERROR(VLOOKUP(MONTH(Calculator!C564),'Month mapping'!A:B,2,0),\"\")","v":""},{"$f":"Calculator!D564","v":""},{"$f":"Calculator!E564","v":""},{"$f":"Calculator!G564","v":""},{"$f":"Calculator!H564","v":""},{"$f":"Calculator!I564","v":""},{"$f":"Calculator!J564","v":""}]
[{"$f":"IFERROR(YEAR(Calculator!C565),\"\")","v":""},{"$f":"IFERROR(VLOOKUP(MONTH(Calculator!C565),'Month mapping'!A:B,2,0),\"\")","v":""},{"$f":"Calculator!D565","v":""},{"$f":"Calculator!E565","v":""},{"$f":"Calculator!G565","v":""},{"$f":"Calculator!H565","v":""},{"$f":"Calculator!I565","v":""},{"$f":"Calculator!J565","v":""}]
[{"$f":"IFERROR(YEAR(Calculator!C566),\"\")","v":""},{"$f":"IFERROR(VLOOKUP(MONTH(Calculator!C566),'Month mapping'!A:B,2,0),\"\")","v":""},{"$f":"Calculator!D566","v":""},{"$f":"Calculator!E566","v":""},{"$f":"Calculator!G566","v":""},{"$f":"Calculator!H566","v":""},{"$f":"Calculator!I566","v":""},{"$f":"Calculator!J566","v":""}]
[{"$f":"IFERROR(YEAR(Calculator!C567),\"\")","v":""},{"$f":"IFERROR(VLOOKUP(MONTH(Calculator!C567),'Month mapping'!A:B,2,0),\"\")","v":""},{"$f":"Calculator!D567","v":""},{"$f":"Calculator!E567","v":""},{"$f":"Calculator!G567","v":""},{"$f":"Calculator!H567","v":""},{"$f":"Calculator!I567","v":""},{"$f":"Calculator!J567","v":""}]
[{"$f":"IFERROR(YEAR(Calculator!C568),\"\")","v":""},{"$f":"IFERROR(VLOOKUP(MONTH(Calculator!C568),'Month mapping'!A:B,2,0),\"\")","v":""},{"$f":"Calculator!D568","v":""},{"$f":"Calculator!E568","v":""},{"$f":"Calculator!G568","v":""},{"$f":"Calculator!H568","v":""},{"$f":"Calculator!I568","v":""},{"$f":"Calculator!J568","v":""}]
[{"$f":"IFERROR(YEAR(Calculator!C569),\"\")","v":""},{"$f":"IFERROR(VLOOKUP(MONTH(Calculator!C569),'Month mapping'!A:B,2,0),\"\")","v":""},{"$f":"Calculator!D569","v":""},{"$f":"Calculator!E569","v":""},{"$f":"Calculator!G569","v":""},{"$f":"Calculator!H569","v":""},{"$f":"Calculator!I569","v":""},{"$f":"Calculator!J569","v":""}]
[{"$f":"IFERROR(YEAR(Calculator!C570),\"\")","v":""},{"$f":"IFERROR(VLOOKUP(MONTH(Calculator!C570),'Month mapping'!A:B,2,0),\"\")","v":""},{"$f":"Calculator!D570","v":""},{"$f":"Calculator!E570","v":""},{"$f":"Calculator!G570","v":""},{"$f":"Calculator!H570","v":""},{"$f":"Calculator!I570","v":""},{"$f":"Calculator!J570","v":""}]
[{"$f":"IFERROR(YEAR(Calculator!C571),\"\")","v":""},{"$f":"IFERROR(VLOOKUP(MONTH(Calculator!C571),'Month mapping'!A:B,2,0),\"\")","v":""},{"$f":"Calculator!D571","v":""},{"$f":"Calculator!E571","v":""},{"$f":"Calculator!G571","v":""},{"$f":"Calculator!H571","v":""},{"$f":"Calculator!I571","v":""},{"$f":"Calculator!J571","v":""}]
[{"$f":"IFERROR(YEAR(Calculator!C572),\"\")","v":""},{"$f":"IFERROR(VLOOKUP(MONTH(Calculator!C572),'Month mapping'!A:B,2,0),\"\")","v":""},{"$f":"Calculator!D572","v":""},{"$f":"Calculator!E572","v":""},{"$f":"Calculator!G572","v":""},{"$f":"Calculator!H572","v":""},{"$f":"Calculator!I572","v":""},{"$f":"Calculator!J572","v":""}]
[{"$f":"IFERROR(YEAR(Calculator!C573),\"\")","v":""},{"$f":"IFERROR(VLOOKUP(MONTH(Calculator!C573),'Month mapping'!A:B,2,0),\"\")","v":""},{"$f":"Calculator!D573","v":""},{"$f":"Calculator!E573","v":""},{"$f":"Calculator!G573","v":""},{"$f":"Calculator!H573","v":""},{"$f":"Calculator!I573","v":""},{"$f":"Calculator!J573","v":""}]
[{"$f":"IFERROR(YEAR(Calculator!C574),\"\")","v":""},{"$f":"IFERROR(VLOOKUP(MONTH(Calculator!C574),'Month mapping'!A:B,2,0),\"\")","v":""},{"$f":"Calculator!D574","v":""},{"$f":"Calculator!E574","v":""},{"$f":"Calculator!G574","v":""},{"$f":"Calculator!H574","v":""},{"$f":"Calculator!I574","v":""},{"$f":"Calculator!J574","v":""}]
[{"$f":"IFERROR(YEAR(Calculator!C575),\"\")","v":""},{"$f":"IFERROR(VLOOKUP(MONTH(Calculator!C575),'Month mapping'!A:B,2,0),\"\")","v":""},{"$f":"Calculator!D575","v":""},{"$f":"Calculator!E575","v":""},{"$f":"Calculator!G575","v":""},{"$f":"Calculator!H575","v":""},{"$f":"Calculator!I575","v":""},{"$f":"Calculator!J575","v":""}]
[{"$f":"IFERROR(YEAR(Calculator!C576),\"\")","v":""},{"$f":"IFERROR(VLOOKUP(MONTH(Calculator!C576),'Month mapping'!A:B,2,0),\"\")","v":""},{"$f":"Calculator!D576","v":""},{"$f":"Calculator!E576","v":""},{"$f":"Calculator!G576","v":""},{"$f":"Calculator!H576","v":""},{"$f":"Calculator!I576","v":""},{"$f":"Calculator!J576","v":""}]
[{"$f":"IFERROR(YEAR(Calculator!C577),\"\")","v":""},{"$f":"IFERROR(VLOOKUP(MONTH(Calculator!C577),'Month mapping'!A:B,2,0),\"\")","v":""},{"$f":"Calculator!D577","v":""},{"$f":"Calculator!E577","v":""},{"$f":"Calculator!G577","v":""},{"$f":"Calculator!H577","v":""},{"$f":"Calculator!I577","v":""},{"$f":"Calculator!J577","v":""}]
[{"$f":"IFERROR(YEAR(Calculator!C578),\"\")","v":""},{"$f":"IFERROR(VLOOKUP(MONTH(Calculator!C578),'Month mapping'!A:B,2,0),\"\")","v":""},{"$f":"Calculator!D578","v":""},{"$f":"Calculator!E578","v":""},{"$f":"Calculator!G578","v":""},{"$f":"Calculator!H578","v":""},{"$f":"Calculator!I578","v":""},{"$f":"Calculator!J578","v":""}]
[{"$f":"IFERROR(YEAR(Calculator!C579),\"\")","v":""},{"$f":"IFERROR(VLOOKUP(MONTH(Calculator!C579),'Month mapping'!A:B,2,0),\"\")","v":""},{"$f":"Calculator!D579","v":""},{"$f":"Calculator!E579","v":""},{"$f":"Calculator!G579","v":""},{"$f":"Calculator!H579","v":""},{"$f":"Calculator!I579","v":""},{"$f":"Calculator!J579","v":""}]
[{"$f":"IFERROR(YEAR(Calculator!C580),\"\")","v":""},{"$f":"IFERROR(VLOOKUP(MONTH(Calculator!C580),'Month mapping'!A:B,2,0),\"\")","v":""},{"$f":"Calculator!D580","v":""},{"$f":"Calculator!E580","v":""},{"$f":"Calculator!G580","v":""},{"$f":"Calculator!H580","v":""},{"$f":"Calculator!I580","v":""},{"$f":"Calculator!J580","v":""}]
[{"$f":"IFERROR(YEAR(Calculator!C581),\"\")","v":""},{"$f":"IFERROR(VLOOKUP(MONTH(Calculator!C581),'Month mapping'!A:B,2,0),\"\")","v":""},{"$f":"Calculator!D581","v":""},{"$f":"Calculator!E581","v":""},{"$f":"Calculator!G581","v":""},{"$f":"Calculator!H581","v":""},{"$f":"Calculator!I581","v":""},{"$f":"Calculator!J581","v":""}]
[{"$f":"IFERROR(YEAR(Calculator!C582),\"\")","v":""},{"$f":"IFERROR(VLOOKUP(MONTH(Calculator!C582),'Month mapping'!A:B,2,0),\"\")","v":""},{"$f":"Calculator!D582","v":""},{"$f":"Calculator!E582","v":""},{"$f":"Calculator!G582","v":""},{"$f":"Calculator!H582","v":""},{"$f":"Calculator!I582","v":""},{"$f":"Calculator!J582","v":""}]
[{"$f":"IFERROR(YEAR(Calculator!C583),\"\")","v":""},{"$f":"IFERROR(VLOOKUP(MONTH(Calculator!C583),'Month mapping'!A:B,2,0),\"\")","v":""},{"$f":"Calculator!D583","v":""},{"$f":"Calculator!E583","v":""},{"$f":"Calculator!G583","v":""},{"$f":"Calculator!H583","v":""},{"$f":"Calculator!I583","v":""},{"$f":"Calculator!J583","v":""}]
[{"$f":"IFERROR(YEAR(Calculator!C584),\"\")","v":""},{"$f":"IFERROR(VLOOKUP(MONTH(Calculator!C584),'Month mapping'!A:B,2,0),\"\")","v":""},{"$f":"Calculator!D584","v":""},{"$f":"Calculator!E584","v":""},{"$f":"Calculator!G584","v":""},{"$f":"Calculator!H584","v":""},{"$f":"Calculator!I584","v":""},{"$f":"Calculator!J584","v":""}]
[{"$f":"IFERROR(YEAR(Calculator!C585),\"\")","v":""},{"$f":"IFERROR(VLOOKUP(MONTH(Calculator!C585),'Month mapping'!A:B,2,0),\"\")","v":""},{"$f":"Calculator!D585","v":""},{"$f":"Calculator!E585","v":""},{"$f":"Calculator!G585","v":""},{"$f":"Calculator!H585","v":""},{"$f":"Calculator!I585","v":""},{"$f":"Calculator!J585","v":""}]
[{"$f":"IFERROR(YEAR(Calculator!C586),\"\")","v":""},{"$f":"IFERROR(VLOOKUP(MONTH(Calculator!C586),'Month mapping'!A:B,2,0),\"\")","v":""},{"$f":"Calculator!D586","v":""},{"$f":"Calculator!E586","v":""},{"$f":"Calculator!G586","v":""},{"$f":"Calculator!H586","v":""},{"$f":"Calculator!I586","v":""},{"$f":"Calculator!J586","v":""}]
[{"$f":"IFERROR(YEAR(Calculator!C587),\"\")","v":""},{"$f":"IFERROR(VLOOKUP(MONTH(Calculator!C587),'Month mapping'!A:B,2,0),\"\")","v":""},{"$f":"Calculator!D587","v":""},{"$f":"Calculator!E587","v":""},{"$f":"Calculator!G587","v":""},{"$f":"Calculator!H587","v":""},{"$f":"Calculator!I587","v":""},{"$f":"Calculator!J587","v":""}]
[{"$f":"IFERROR(YEAR(Calculator!C588),\"\")","v":""},{"$f":"IFERROR(VLOOKUP(MONTH(Calculator!C588),'Month mapping'!A:B,2,0),\"\")","v":""},{"$f":"Calculator!D588","v":""},{"$f":"Calculator!E588","v":""},{"$f":"Calculator!G588","v":""},{"$f":"Calculator!H588","v":""},{"$f":"Calculator!I588","v":""},{"$f":"Calculator!J588","v":""}]
[{"$f":"IFERROR(YEAR(Calculator!C589),\"\")","v":""},{"$f":"IFERROR(VLOOKUP(MONTH(Calculator!C589),'Month mapping'!A:B,2,0),\"\")","v":""},{"$f":"Calculator!D589","v":""},{"$f":"Calculator!E589","v":""},{"$f":"Calculator!G589","v":""},{"$f":"Calculator!H589","v":""},{"$f":"Calculator!I589","v":""},{"$f":"Calculator!J589","v":""}]
[{"$f":"IFERROR(YEAR(Calculator!C590),\"\")","v":""},{"$f":"IFERROR(VLOOKUP(MONTH(Calculator!C590),'Month mapping'!A:B,2,0),\"\")","v":""},{"$f":"Calculator!D590","v":""},{"$f":"Calculator!E590","v":""},{"$f":"Calculator!G590","v":""},{"$f":"Calculator!H590","v":""},{"$f":"Calculator!I590","v":""},{"$f":"Calculator!J590","v":""}]
[{"$f":"IFERROR(YEAR(Calculator!C591),\"\")","v":""},{"$f":"IFERROR(VLOOKUP(MONTH(Calculator!C591),'Month mapping'!A:B,2,0),\"\")","v":""},{"$f":"Calculator!D591","v":""},{"$f":"Calculator!E591","v":""},{"$f":"Calculator!G591","v":""},{"$f":"Calculator!H591","v":""},{"$f":"Calculator!I591","v":""},{"$f":"Calculator!J591","v":""}]
[{"$f":"IFERROR(YEAR(Calculator!C592),\"\")","v":""},{"$f":"IFERROR(VLOOKUP(MONTH(Calculator!C592),'Month mapping'!A:B,2,0),\"\")","v":""},{"$f":"Calculator!D592","v":""},{"$f":"Calculator!E592","v":""},{"$f":"Calculator!G592","v":""},{"$f":"Calculator!H592","v":""},{"$f":"Calculator!I592","v":""},{"$f":"Calculator!J592","v":""}]
[{"$f":"IFERROR(YEAR(Calculator!C593),\"\")","v":""},{"$f":"IFERROR(VLOOKUP(MONTH(Calculator!C593),'Month mapping'!A:B,2,0),\"\")","v":""},{"$f":"Calculator!D593","v":""},{"$f":"Calculator!E593","v":""},{"$f":"Calculator!G593","v":""},{"$f":"Calculator!H593","v":""},{"$f":"Calculator!I593","v":""},{"$f":"Calculator!J593","v":""}]
[{"$f":"IFERROR(YEAR(Calculator!C594),\"\")","v":""},{"$f":"IFERROR(VLOOKUP(MONTH(Calculator!C594),'Month mapping'!A:B,2,0),\"\")","v":""},{"$f":"Calculator!D594","v":""},{"$f":"Calculator!E594","v":""},{"$f":"Calculator!G594","v":""},{"$f":"Calculator!H594","v":""},{"$f":"Calculator!I594","v":""},{"$f":"Calculator!J594","v":""}]
[{"$f":"IFERROR(YEAR(Calculator!C595),\"\")","v":""},{"$f":"IFERROR(VLOOKUP(MONTH(Calculator!C595),'Month mapping'!A:B,2,0),\"\")","v":""},{"$f":"Calculator!D595","v":""},{"$f":"Calculator!E595","v":""},{"$f":"Calculator!G595","v":""},{"$f":"Calculator!H595","v":""},{"$f":"Calculator!I595","v":""},{"$f":"Calculator!J595","v":""}]
[{"$f":"IFERROR(YEAR(Calculator!C596),\"\")","v":""},{"$f":"IFERROR(VLOOKUP(MONTH(Calculator!C596),'Month mapping'!A:B,2,0),\"\")","v":""},{"$f":"Calculator!D596","v":""},{"$f":"Calculator!E596","v":""},{"$f":"Calculator!G596","v":""},{"$f":"Calculator!H596","v":""},{"$f":"Calculator!I596","v":""},{"$f":"Calculator!J596","v":""}]
[{"$f":"IFERROR(YEAR(Calculator!C597),\"\")","v":""},{"$f":"IFERROR(VLOOKUP(MONTH(Calculator!C597),'Month mapping'!A:B,2,0),\"\")","v":""},{"$f":"Calculator!D597","v":""},{"$f":"Calculator!E597","v":""},{"$f":"Calculator!G597","v":""},{"$f":"Calculator!H597","v":""},{"$f":"Calculator!I597","v":""},{"$f":"Calculator!J597","v":""}]
[{"$f":"IFERROR(YEAR(Calculator!C598),\"\")","v":""},{"$f":"IFERROR(VLOOKUP(MONTH(Calculator!C598),'Month mapping'!A:B,2,0),\"\")","v":""},{"$f":"Calculator!D598","v":""},{"$f":"Calculator!E598","v":""},{"$f":"Calculator!G598","v":""},{"$f":"Calculator!H598","v":""},{"$f":"Calculator!I598","v":""},{"$f":"Calculator!J598","v":""}]
[{"$f":"IFERROR(YEAR(Calculator!C599),\"\")","v":""},{"$f":"IFERROR(VLOOKUP(MONTH(Calculator!C599),'Month mapping'!A:B,2,0),\"\")","v":""},{"$f":"Calculator!D599","v":""},{"$f":"Calculator!E599","v":""},{"$f":"Calculator!G599","v":""},{"$f":"Calculator!H599","v":""},{"$f":"Calculator!I599","v":""},{"$f":"Calculator!J599","v":""}]
[{"$f":"IFERROR(YEAR(Calculator!C600),\"\")","v":""},{"$f":"IFERROR(VLOOKUP(MONTH(Calculator!C600),'Month mapping'!A:B,2,0),\"\")","v":""},{"$f":"Calculator!D600","v":""},{"$f":"Calculator!E600","v":""},{"$f":"Calculator!G600","v":""},{"$f":"Calculator!H600","v":""},{"$f":"Calculator!I600","v":""},{"$f":"Calculator!J600","v":""}]
[{"$f":"IFERROR(YEAR(Calculator!C601),\"\")","v":""},{"$f":"IFERROR(VLOOKUP(MONTH(Calculator!C601),'Month mapping'!A:B,2,0),\"\")","v":""},{"$f":"Calculator!D601","v":""},{"$f":"Calculator!E601","v":""},{"$f":"Calculator!G601","v":""},{"$f":"Calculator!H601","v":""},{"$f":"Calculator!I601","v":""},{"$f":"Calculator!J601","v":""}]
[{"$f":"IFERROR(YEAR(Calculator!C602),\"\")","v":""},{"$f":"IFERROR(VLOOKUP(MONTH(Calculator!C602),'Month mapping'!A:B,2,0),\"\")","v":""},{"$f":"Calculator!D602","v":""},{"$f":"Calculator!E602","v":""},{"$f":"Calculator!G602","v":""},{"$f":"Calculator!H602","v":""},{"$f":"Calculator!I602","v":""},{"$f":"Calculator!J602","v":""}]
[{"$f":"IFERROR(YEAR(Calculator!C603),\"\")","v":""},{"$f":"IFERROR(VLOOKUP(MONTH(Calculator!C603),'Month mapping'!A:B,2,0),\"\")","v":""},{"$f":"Calculator!D603","v":""},{"$f":"Calculator!E603","v":""},{"$f":"Calculator!G603","v":""},{"$f":"Calculator!H603","v":""},{"$f":"Calculator!I603","v":""},{"$f":"Calculator!J603","v":""}]
[{"$f":"IFERROR(YEAR(Calculator!C604),\"\")","v":""},{"$f":"IFERROR(VLOOKUP(MONTH(Calculator!C604),'Month mapping'!A:B,2,0),\"\")","v":""},{"$f":"Calculator!D604","v":""},{"$f":"Calculator!E604","v":""},{"$f":"Calculator!G604","v":""},{"$f":"Calculator!H604","v":""},{"$f":"Calculator!I604","v":""},{"$f":"Calculator!J604","v":""}]
[{"$f":"IFERROR(YEAR(Calculator!C605),\"\")","v":""},{"$f":"IFERROR(VLOOKUP(MONTH(Calculator!C605),'Month mapping'!A:B,2,0),\"\")","v":""},{"$f":"Calculator!D605","v":""},{"$f":"Calculator!E605","v":""},{"$f":"Calculator!G605","v":""},{"$f":"Calculator!H605","v":""},{"$f":"Calculator!I605","v":""},{"$f":"Calculator!J605","v":""}]
[{"$f":"IFERROR(YEAR(Calculator!C606),\"\")","v":""},{"$f":"IFERROR(VLOOKUP(MONTH(Calculator!C606),'Month mapping'!A:B,2,0),\"\")","v":""},{"$f":"Calculator!D606","v":""},{"$f":"Calculator!E606","v":""},{"$f":"Calculator!G606","v":""},{"$f":"Calculator!H606","v":""},{"$f":"Calculator!I606","v":""},{"$f":"Calculator!J606","v":""}]
[{"$f":"IFERROR(YEAR(Calculator!C607),\"\")","v":""},{"$f":"IFERROR(VLOOKUP(MONTH(Calculator!C607),'Month mapping'!A:B,2,0),\"\")","v":""},{"$f":"Calculator!D607","v":""},{"$f":"Calculator!E607","v":""},{"$f":"Calculator!G607","v":""},{"$f":"Calculator!H607","v":""},{"$f":"Calculator!I607","v":""},{"$f":"Calculator!J607","v":""}]
[{"$f":"IFERROR(YEAR(Calculator!C608),\"\")","v":""},{"$f":"IFERROR(VLOOKUP(MONTH(Calculator!C608),'Month mapping'!A:B,2,0),\"\")","v":""},{"$f":"Calculator!D608","v":""},{"$f":"Calculator!E608","v":""},{"$f":"Calculator!G608","v":""},{"$f":"Calculator!H608","v":""},{"$f":"Calculator!I608","v":""},{"$f":"Calculator!J608","v":""}]
[{"$f":"IFERROR(YEAR(Calculator!C609),\"\")","v":""},{"$f":"IFERROR(VLOOKUP(MONTH(Calculator!C609),'Month mapping'!A:B,2,0),\"\")","v":""},{"$f":"Calculator!D609","v":""},{"$f":"Calculator!E609","v":""},{"$f":"Calculator!G609","v":""},{"$f":"Calculator!H609","v":""},{"$f":"Calculator!I609","v":""},{"$f":"Calculator!J609","v":""}]
[{"$f":"IFERROR(YEAR(Calculator!C610),\"\")","v":""},{"$f":"IFERROR(VLOOKUP(MONTH(Calculator!C610),'Month mapping'!A:B,2,0),\"\")","v":""},{"$f":"Calculator!D610","v":""},{"$f":"Calculator!E610","v":""},{"$f":"Calculator!G610","v":""},{"$f":"Calculator!H610","v":""},{"$f":"Calculator!I610","v":""},{"$f":"Calculator!J610","v":""}]
[{"$f":"IFERROR(YEAR(Calculator!C611),\"\")","v":""},{"$f":"IFERROR(VLOOKUP(MONTH(Calculator!C611),'Month mapping'!A:B,2,0),\"\")","v":""},{"$f":"Calculator!D611","v":""},{"$f":"Calculator!E611","v":""},{"$f":"Calculator!G611","v":""},{"$f":"Calculator!H611","v":""},{"$f":"Calculator!I611","v":""},{"$f":"Calculator!J611","v":""}]
[{"$f":"IFERROR(YEAR(Calculator!C612),\"\")","v":""},{"$f":"IFERROR(VLOOKUP(MONTH(Calculator!C612),'Month mapping'!A:B,2,0),\"\")","v":""},{"$f":"Calculator!D612","v":""},{"$f":"Calculator!E612","v":""},{"$f":"Calculator!G612","v":""},{"$f":"Calculator!H612","v":""},{"$f":"Calculator!I612","v":""},{"$f":"Calculator!J612","v":""}]
[{"$f":"IFERROR(YEAR(Calculator!C613),\"\")","v":""},{"$f":"IFERROR(VLOOKUP(MONTH(Calculator!C613),'Month mapping'!A:B,2,0),\"\")","v":""},{"$f":"Calculator!D613","v":""},{"$f":"Calculator!E613","v":""},{"$f":"Calculator!G613","v":""},{"$f":"Calculator!H613","v":""},{"$f":"Calculator!I613","v":""},{"$f":"Calculator!J613","v":""}]
[{"$f":"IFERROR(YEAR(Calculator!C614),\"\")","v":""},{"$f":"IFERROR(VLOOKUP(MONTH(Calculator!C614),'Month mapping'!A:B,2,0),\"\")","v":""},{"$f":"Calculator!D614","v":""},{"$f":"Calculator!E614","v":""},{"$f":"Calculator!G614","v":""},{"$f":"Calculator!H614","v":""},{"$f":"Calculator!I614","v":""},{"$f":"Calculator!J614","v":""}]
[{"$f":"IFERROR(YEAR(Calculator!C615),\"\")","v":""},{"$f":"IFERROR(VLOOKUP(MONTH(Calculator!C615),'Month mapping'!A:B,2,0),\"\")","v":""},{"$f":"Calculator!D615","v":""},{"$f":"Calculator!E615","v":""},{"$f":"Calculator!G615","v":""},{"$f":"Calculator!H615","v":""},{"$f":"Calculator!I615","v":""},{"$f":"Calculator!J615","v":""}]
[{"$f":"IFERROR(YEAR(Calculator!C616),\"\")","v":""},{"$f":"IFERROR(VLOOKUP(MONTH(Calculator!C616),'Month mapping'!A:B,2,0),\"\")","v":""},{"$f":"Calculator!D616","v":""},{"$f":"Calculator!E616","v":""},{"$f":"Calculator!G616","v":""},{"$f":"Calculator!H616","v":""},{"$f":"Calculator!I616","v":""},{"$f":"Calculator!J616","v":""}]
[{"$f":"IFERROR(YEAR(Calculator!C617),\"\")","v":""},{"$f":"IFERROR(VLOOKUP(MONTH(Calculator!C617),'Month mapping'!A:B,2,0),\"\")","v":""},{"$f":"Calculator!D617","v":""},{"$f":"Calculator!E617","v":""},{"$f":"Calculator!G617","v":""},{"$f":"Calculator!H617","v":""},{"$f":"Calculator!I617","v":""},{"$f":"Calculator!J617","v":""}]
[{"$f":"IFERROR(YEAR(Calculator!C618),\"\")","v":""},{"$f":"IFERROR(VLOOKUP(MONTH(Calculator!C618),'Month mapping'!A:B,2,0),\"\")","v":""},{"$f":"Calculator!D618","v":""},{"$f":"Calculator!E618","v":""},{"$f":"Calculator!G618","v":""},{"$f":"Calculator!H618","v":""},{"$f":"Calculator!I618","v":""},{"$f":"Calculator!J618","v":""}]
[{"$f":"IFERROR(YEAR(Calculator!C619),\"\")","v":""},{"$f":"IFERROR(VLOOKUP(MONTH(Calculator!C619),'Month mapping'!A:B,2,0),\"\")","v":""},{"$f":"Calculator!D619","v":""},{"$f":"Calculator!E619","v":""},{"$f":"Calculator!G619","v":""},{"$f":"Calculator!H619","v":""},{"$f":"Calculator!I619","v":""},{"$f":"Calculator!J619","v":""}]
[{"$f":"IFERROR(YEAR(Calculator!C620),\"\")","v":""},{"$f":"IFERROR(VLOOKUP(MONTH(Calculator!C620),'Month mapping'!A:B,2,0),\"\")","v":""},{"$f":"Calculator!D620","v":""},{"$f":"Calculator!E620","v":""},{"$f":"Calculator!G620","v":""},{"$f":"Calculator!H620","v":""},{"$f":"Calculator!I620","v":""},{"$f":"Calculator!J620","v":""}]
[{"$f":"IFERROR(YEAR(Calculator!C621),\"\")","v":""},{"$f":"IFERROR(VLOOKUP(MONTH(Calculator!C621),'Month mapping'!A:B,2,0),\"\")","v":""},{"$f":"Calculator!D621","v":""},{"$f":"Calculator!E621","v":""},{"$f":"Calculator!G621","v":""},{"$f":"Calculator!H621","v":""},{"$f":"Calculator!I621","v":""},{"$f":"Calculator!J621","v":""}]
[{"$f":"IFERROR(YEAR(Calculator!C622),\"\")","v":""},{"$f":"IFERROR(VLOOKUP(MONTH(Calculator!C622),'Month mapping'!A:B,2,0),\"\")","v":""},{"$f":"Calculator!D622","v":""},{"$f":"Calculator!E622","v":""},{"$f":"Calculator!G622","v":""},{"$f":"Calculator!H622","v":""},{"$f":"Calculator!I622","v":""},{"$f":"Calculator!J622","v":""}]
[{"$f":"IFERROR(YEAR(Calculator!C623),\"\")","v":""},{"$f":"IFERROR(VLOOKUP(MONTH(Calculator!C623),'Month mapping'!A:B,2,0),\"\")","v":""},{"$f":"Calculator!D623","v":""},{"$f":"Calculator!E623","v":""},{"$f":"Calculator!G623","v":""},{"$f":"Calculator!H623","v":""},{"$f":"Calculator!I623","v":""},{"$f":"Calculator!J623","v":""}]
[{"$f":"IFERROR(YEAR(Calculator!C624),\"\")","v":""},{"$f":"IFERROR(VLOOKUP(MONTH(Calculator!C624),'Month mapping'!A:B,2,0),\"\")","v":""},{"$f":"Calculator!D624","v":""},{"$f":"Calculator!E624","v":""},{"$f":"Calculator!G624","v":""},{"$f":"Calculator!H624","v":""},{"$f":"Calculator!I624","v":""},{"$f":"Calculator!J624","v":""}]
[{"$f":"IFERROR(YEAR(Calculator!C625),\"\")","v":""},{"$f":"IFERROR(VLOOKUP(MONTH(Calculator!C625),'Month mapping'!A:B,2,0),\"\")","v":""},{"$f":"Calculator!D625","v":""},{"$f":"Calculator!E625","v":""},{"$f":"Calculator!G625","v":""},{"$f":"Calculator!H625","v":""},{"$f":"Calculator!I625","v":""},{"$f":"Calculator!J625","v":""}]
[{"$f":"IFERROR(YEAR(Calculator!C626),\"\")","v":""},{"$f":"IFERROR(VLOOKUP(MONTH(Calculator!C626),'Month mapping'!A:B,2,0),\"\")","v":""},{"$f":"Calculator!D626","v":""},{"$f":"Calculator!E626","v":""},{"$f":"Calculator!G626","v":""},{"$f":"Calculator!H626","v":""},{"$f":"Calculator!I626","v":""},{"$f":"Calculator!J626","v":""}]
[{"$f":"IFERROR(YEAR(Calculator!C627),\"\")","v":""},{"$f":"IFERROR(VLOOKUP(MONTH(Calculator!C627),'Month mapping'!A:B,2,0),\"\")","v":""},{"$f":"Calculator!D627","v":""},{"$f":"Calculator!E627","v":""},{"$f":"Calculator!G627","v":""},{"$f":"Calculator!H627","v":""},{"$f":"Calculator!I627","v":""},{"$f":"Calculator!J627","v":""}]
[{"$f":"IFERROR(YEAR(Calculator!C628),\"\")","v":""},{"$f":"IFERROR(VLOOKUP(MONTH(Calculator!C628),'Month mapping'!A:B,2,0),\"\")","v":""},{"$f":"Calculator!D628","v":""},{"$f":"Calculator!E628","v":""},{"$f":"Calculator!G628","v":""},{"$f":"Calculator!H628","v":""},{"$f":"Calculator!I628","v":""},{"$f":"Calculator!J628","v":""}]
[{"$f":"IFERROR(YEAR(Calculator!C629),\"\")","v":""},{"$f":"IFERROR(VLOOKUP(MONTH(Calculator!C629),'Month mapping'!A:B,2,0),\"\")","v":""},{"$f":"Calculator!D629","v":""},{"$f":"Calculator!E629","v":""},{"$f":"Calculator!G629","v":""},{"$f":"Calculator!H629","v":""},{"$f":"Calculator!I629","v":""},{"$f":"Calculator!J629","v":""}]
[{"$f":"IFERROR(YEAR(Calculator!C630),\"\")","v":""},{"$f":"IFERROR(VLOOKUP(MONTH(Calculator!C630),'Month mapping'!A:B,2,0),\"\")","v":""},{"$f":"Calculator!D630","v":""},{"$f":"Calculator!E630","v":""},{"$f":"Calculator!G630","v":""},{"$f":"Calculator!H630","v":""},{"$f":"Calculator!I630","v":""},{"$f":"Calculator!J630","v":""}]
[{"$f":"IFERROR(YEAR(Calculator!C631),\"\")","v":""},{"$f":"IFERROR(VLOOKUP(MONTH(Calculator!C631),'Month mapping'!A:B,2,0),\"\")","v":""},{"$f":"Calculator!D631","v":""},{"$f":"Calculator!E631","v":""},{"$f":"Calculator!G631","v":""},{"$f":"Calculator!H631","v":""},{"$f":"Calculator!I631","v":""},{"$f":"Calculator!J631","v":""}]
[{"$f":"IFERROR(YEAR(Calculator!C632),\"\")","v":""},{"$f":"IFERROR(VLOOKUP(MONTH(Calculator!C632),'Month mapping'!A:B,2,0),\"\")","v":""},{"$f":"Calculator!D632","v":""},{"$f":"Calculator!E632","v":""},{"$f":"Calculator!G632","v":""},{"$f":"Calculator!H632","v":""},{"$f":"Calculator!I632","v":""},{"$f":"Calculator!J632","v":""}]
[{"$f":"IFERROR(YEAR(Calculator!C633),\"\")","v":""},{"$f":"IFERROR(VLOOKUP(MONTH(Calculator!C633),'Month mapping'!A:B,2,0),\"\")","v":""},{"$f":"Calculator!D633","v":""},{"$f":"Calculator!E633","v":""},{"$f":"Calculator!G633","v":""},{"$f":"Calculator!H633","v":""},{"$f":"Calculator!I633","v":""},{"$f":"Calculator!J633","v":""}]
[{"$f":"IFERROR(YEAR(Calculator!C634),\"\")","v":""},{"$f":"IFERROR(VLOOKUP(MONTH(Calculator!C634),'Month mapping'!A:B,2,0),\"\")","v":""},{"$f":"Calculator!D634","v":""},{"$f":"Calculator!E634","v":""},{"$f":"Calculator!G634","v":""},{"$f":"Calculator!H634","v":""},{"$f":"Calculator!I634","v":""},{"$f":"Calculator!J634","v":""}]
[{"$f":"IFERROR(YEAR(Calculator!C635),\"\")","v":""},{"$f":"IFERROR(VLOOKUP(MONTH(Calculator!C635),'Month mapping'!A:B,2,0),\"\")","v":""},{"$f":"Calculator!D635","v":""},{"$f":"Calculator!E635","v":""},{"$f":"Calculator!G635","v":""},{"$f":"Calculator!H635","v":""},{"$f":"Calculator!I635","v":""},{"$f":"Calculator!J635","v":""}]
[{"$f":"IFERROR(YEAR(Calculator!C636),\"\")","v":""},{"$f":"IFERROR(VLOOKUP(MONTH(Calculator!C636),'Month mapping'!A:B,2,0),\"\")","v":""},{"$f":"Calculator!D636","v":""},{"$f":"Calculator!E636","v":""},{"$f":"Calculator!G636","v":""},{"$f":"Calculator!H636","v":""},{"$f":"Calculator!I636","v":""},{"$f":"Calculator!J636","v":""}]
[{"$f":"IFERROR(YEAR(Calculator!C637),\"\")","v":""},{"$f":"IFERROR(VLOOKUP(MONTH(Calculator!C637),'Month mapping'!A:B,2,0),\"\")","v":""},{"$f":"Calculator!D637","v":""},{"$f":"Calculator!E637","v":""},{"$f":"Calculator!G637","v":""},{"$f":"Calculator!H637","v":""},{"$f":"Calculator!I637","v":""},{"$f":"Calculator!J637","v":""}]
[{"$f":"IFERROR(YEAR(Calculator!C638),\"\")","v":""},{"$f":"IFERROR(VLOOKUP(MONTH(Calculator!C638),'Month mapping'!A:B,2,0),\"\")","v":""},{"$f":"Calculator!D638","v":""},{"$f":"Calculator!E638","v":""},{"$f":"Calculator!G638","v":""},{"$f":"Calculator!H638","v":""},{"$f":"Calculator!I638","v":""},{"$f":"Calculator!J638","v":""}]
[{"$f":"IFERROR(YEAR(Calculator!C639),\"\")","v":""},{"$f":"IFERROR(VLOOKUP(MONTH(Calculator!C639),'Month mapping'!A:B,2,0),\"\")","v":""},{"$f":"Calculator!D639","v":""},{"$f":"Calculator!E639","v":""},{"$f":"Calculator!G639","v":""},{"$f":"Calculator!H639","v":""},{"$f":"Calculator!I639","v":""},{"$f":"Calculator!J639","v":""}]
[{"$f":"IFERROR(YEAR(Calculator!C640),\"\")","v":""},{"$f":"IFERROR(VLOOKUP(MONTH(Calculator!C640),'Month mapping'!A:B,2,0),\"\")","v":""},{"$f":"Calculator!D640","v":""},{"$f":"Calculator!E640","v":""},{"$f":"Calculator!G640","v":""},{"$f":"Calculator!H640","v":""},{"$f":"Calculator!I640","v":""},{"$f":"Calculator!J640","v":""}]
[{"$f":"IFERROR(YEAR(Calculator!C641),\"\")","v":""},{"$f":"IFERROR(VLOOKUP(MONTH(Calculator!C641),'Month mapping'!A:B,2,0),\"\")","v":""},{"$f":"Calculator!D641","v":""},{"$f":"Calculator!E641","v":""},{"$f":"Calculator!G641","v":""},{"$f":"Calculator!H641","v":""},{"$f":"Calculator!I641","v":""},{"$f":"Calculator!J641","v":""}]
[{"$f":"IFERROR(YEAR(Calculator!C642),\"\")","v":""},{"$f":"IFERROR(VLOOKUP(MONTH(Calculator!C642),'Month mapping'!A:B,2,0),\"\")","v":""},{"$f":"Calculator!D642","v":""},{"$f":"Calculator!E642","v":""},{"$f":"Calculator!G642","v":""},{"$f":"Calculator!H642","v":""},{"$f":"Calculator!I642","v":""},{"$f":"Calculator!J642","v":""}]
[{"$f":"IFERROR(YEAR(Calculator!C643),\"\")","v":""},{"$f":"IFERROR(VLOOKUP(MONTH(Calculator!C643),'Month mapping'!A:B,2,0),\"\")","v":""},{"$f":"Calculator!D643","v":""},{"$f":"Calculator!E643","v":""},{"$f":"Calculator!G643","v":""},{"$f":"Calculator!H643","v":""},{"$f":"Calculator!I643","v":""},{"$f":"Calculator!J643","v":""}]
[{"$f":"IFERROR(YEAR(Calculator!C644),\"\")","v":""},{"$f":"IFERROR(VLOOKUP(MONTH(Calculator!C644),'Month mapping'!A:B,2,0),\"\")","v":""},{"$f":"Calculator!D644","v":""},{"$f":"Calculator!E644","v":""},{"$f":"Calculator!G644","v":""},{"$f":"Calculator!H644","v":""},{"$f":"Calculator!I644","v":""},{"$f":"Calculator!J644","v":""}]
[{"$f":"IFERROR(YEAR(Calculator!C645),\"\")","v":""},{"$f":"IFERROR(VLOOKUP(MONTH(Calculator!C645),'Month mapping'!A:B,2,0),\"\")","v":""},{"$f":"Calculator!D645","v":""},{"$f":"Calculator!E645","v":""},{"$f":"Calculator!G645","v":""},{"$f":"Calculator!H645","v":""},{"$f":"Calculator!I645","v":""},{"$f":"Calculator!J645","v":""}]
[{"$f":"IFERROR(YEAR(Calculator!C646),\"\")","v":""},{"$f":"IFERROR(VLOOKUP(MONTH(Calculator!C646),'Month mapping'!A:B,2,0),\"\")","v":""},{"$f":"Calculator!D646","v":""},{"$f":"Calculator!E646","v":""},{"$f":"Calculator!G646","v":""},{"$f":"Calculator!H646","v":""},{"$f":"Calculator!I646","v":""},{"$f":"Calculator!J646","v":""}]
[{"$f":"IFERROR(YEAR(Calculator!C647),\"\")","v":""},{"$f":"IFERROR(VLOOKUP(MONTH(Calculator!C647),'Month mapping'!A:B,2,0),\"\")","v":""},{"$f":"Calculator!D647","v":""},{"$f":"Calculator!E647","v":""},{"$f":"Calculator!G647","v":""},{"$f":"Calculator!H647","v":""},{"$f":"Calculator!I647","v":""},{"$f":"Calculator!J647","v":""}]
[{"$f":"IFERROR(YEAR(Calculator!C648),\"\")","v":""},{"$f":"IFERROR(VLOOKUP(MONTH(Calculator!C648),'Month mapping'!A:B,2,0),\"\")","v":""},{"$f":"Calculator!D648","v":""},{"$f":"Calculator!E648","v":""},{"$f":"Calculator!G648","v":""},{"$f":"Calculator!H648","v":""},{"$f":"Calculator!I648","v":""},{"$f":"Calculator!J648","v":""}]
[{"$f":"IFERROR(YEAR(Calculator!C649),\"\")","v":""},{"$f":"IFERROR(VLOOKUP(MONTH(Calculator!C649),'Month mapping'!A:B,2,0),\"\")","v":""},{"$f":"Calculator!D649","v":""},{"$f":"Calculator!E649","v":""},{"$f":"Calculator!G649","v":""},{"$f":"Calculator!H649","v":""},{"$f":"Calculator!I649","v":""},{"$f":"Calculator!J649","v":""}]
[{"$f":"IFERROR(YEAR(Calculator!C650),\"\")","v":""},{"$f":"IFERROR(VLOOKUP(MONTH(Calculator!C650),'Month mapping'!A:B,2,0),\"\")","v":""},{"$f":"Calculator!D650","v":""},{"$f":"Calculator!E650","v":""},{"$f":"Calculator!G650","v":""},{"$f":"Calculator!H650","v":""},{"$f":"Calculator!I650","v":""},{"$f":"Calculator!J650","v":""}]
[{"$f":"IFERROR(YEAR(Calculator!C651),\"\")","v":""},{"$f":"IFERROR(VLOOKUP(MONTH(Calculator!C651),'Month mapping'!A:B,2,0),\"\")","v":""},{"$f":"Calculator!D651","v":""},{"$f":"Calculator!E651","v":""},{"$f":"Calculator!G651","v":""},{"$f":"Calculator!H651","v":""},{"$f":"Calculator!I651","v":""},{"$f":"Calculator!J651","v":""}]
[{"$f":"IFERROR(YEAR(Calculator!C652),\"\")","v":""},{"$f":"IFERROR(VLOOKUP(MONTH(Calculator!C652),'Month mapping'!A:B,2,0),\"\")","v":""},{"$f":"Calculator!D652","v":""},{"$f":"Calculator!E652","v":""},{"$f":"Calculator!G652","v":""},{"$f":"Calculator!H652","v":""},{"$f":"Calculator!I652","v":""},{"$f":"Calculator!J652","v":""}]
[{"$f":"IFERROR(YEAR(Calculator!C653),\"\")","v":""},{"$f":"IFERROR(VLOOKUP(MONTH(Calculator!C653),'Month mapping'!A:B,2,0),\"\")","v":""},{"$f":"Calculator!D653","v":""},{"$f":"Calculator!E653","v":""},{"$f":"Calculator!G653","v":""},{"$f":"Calculator!H653","v":""},{"$f":"Calculator!I653","v":""},{"$f":"Calculator!J653","v":""}]
[{"$f":"IFERROR(YEAR(Calculator!C654),\"\")","v":""},{"$f":"IFERROR(VLOOKUP(MONTH(Calculator!C654),'Month mapping'!A:B,2,0),\"\")","v":""},{"$f":"Calculator!D654","v":""},{"$f":"Calculator!E654","v":""},{"$f":"Calculator!G654","v":""},{"$f":"Calculator!H654","v":""},{"$f":"Calculator!I654","v":""},{"$f":"Calculator!J654","v":""}]
[{"$f":"IFERROR(YEAR(Calculator!C655),\"\")","v":""},{"$f":"IFERROR(VLOOKUP(MONTH(Calculator!C655),'Month mapping'!A:B,2,0),\"\")","v":""},{"$f":"Calculator!D655","v":""},{"$f":"Calculator!E655","v":""},{"$f":"Calculator!G655","v":""},{"$f":"Calculator!H655","v":""},{"$f":"Calculator!I655","v":""},{"$f":"Calculator!J655","v":""}]
[{"$f":"IFERROR(YEAR(Calculator!C656),\"\")","v":""},{"$f":"IFERROR(VLOOKUP(MONTH(Calculator!C656),'Month mapping'!A:B,2,0),\"\")","v":""},{"$f":"Calculator!D656","v":""},{"$f":"Calculator!E656","v":""},{"$f":"Calculator!G656","v":""},{"$f":"Calculator!H656","v":""},{"$f":"Calculator!I656","v":""},{"$f":"Calculator!J656","v":""}]
[{"$f":"IFERROR(YEAR(Calculator!C657),\"\")","v":""},{"$f":"IFERROR(VLOOKUP(MONTH(Calculator!C657),'Month mapping'!A:B,2,0),\"\")","v":""},{"$f":"Calculator!D657","v":""},{"$f":"Calculator!E657","v":""},{"$f":"Calculator!G657","v":""},{"$f":"Calculator!H657","v":""},{"$f":"Calculator!I657","v":""},{"$f":"Calculator!J657","v":""}]
[{"$f":"IFERROR(YEAR(Calculator!C658),\"\")","v":""},{"$f":"IFERROR(VLOOKUP(MONTH(Calculator!C658),'Month mapping'!A:B,2,0),\"\")","v":""},{"$f":"Calculator!D658","v":""},{"$f":"Calculator!E658","v":""},{"$f":"Calculator!G658","v":""},{"$f":"Calculator!H658","v":""},{"$f":"Calculator!I658","v":""},{"$f":"Calculator!J658","v":""}]
[{"$f":"IFERROR(YEAR(Calculator!C659),\"\")","v":""},{"$f":"IFERROR(VLOOKUP(MONTH(Calculator!C659),'Month mapping'!A:B,2,0),\"\")","v":""},{"$f":"Calculator!D659","v":""},{"$f":"Calculator!E659","v":""},{"$f":"Calculator!G659","v":""},{"$f":"Calculator!H659","v":""},{"$f":"Calculator!I659","v":""},{"$f":"Calculator!J659","v":""}]
[{"$f":"IFERROR(YEAR(Calculator!C660),\"\")","v":""},{"$f":"IFERROR(VLOOKUP(MONTH(Calculator!C660),'Month mapping'!A:B,2,0),\"\")","v":""},{"$f":"Calculator!D660","v":""},{"$f":"Calculator!E660","v":""},{"$f":"Calculator!G660","v":""},{"$f":"Calculator!H660","v":""},{"$f":"Calculator!I660","v":""},{"$f":"Calculator!J660","v":""}]
[{"$f":"IFERROR(YEAR(Calculator!C661),\"\")","v":""},{"$f":"IFERROR(VLOOKUP(MONTH(Calculator!C661),'Month mapping'!A:B,2,0),\"\")","v":""},{"$f":"Calculator!D661","v":""},{"$f":"Calculator!E661","v":""},{"$f":"Calculator!G661","v":""},{"$f":"Calculator!H661","v":""},{"$f":"Calculator!I661","v":""},{"$f":"Calculator!J661","v":""}]
[{"$f":"IFERROR(YEAR(Calculator!C662),\"\")","v":""},{"$f":"IFERROR(VLOOKUP(MONTH(Calculator!C662),'Month mapping'!A:B,2,0),\"\")","v":""},{"$f":"Calculator!D662","v":""},{"$f":"Calculator!E662","v":""},{"$f":"Calculator!G662","v":""},{"$f":"Calculator!H662","v":""},{"$f":"Calculator!I662","v":""},{"$f":"Calculator!J662","v":""}]
[{"$f":"IFERROR(YEAR(Calculator!C663),\"\")","v":""},{"$f":"IFERROR(VLOOKUP(MONTH(Calculator!C663),'Month mapping'!A:B,2,0),\"\")","v":""},{"$f":"Calculator!D663","v":""},{"$f":"Calculator!E663","v":""},{"$f":"Calculator!G663","v":""},{"$f":"Calculator!H663","v":""},{"$f":"Calculator!I663","v":""},{"$f":"Calculator!J663","v":""}]
[{"$f":"IFERROR(YEAR(Calculator!C664),\"\")","v":""},{"$f":"IFERROR(VLOOKUP(MONTH(Calculator!C664),'Month mapping'!A:B,2,0),\"\")","v":""},{"$f":"Calculator!D664","v":""},{"$f":"Calculator!E664","v":""},{"$f":"Calculator!G664","v":""},{"$f":"Calculator!H664","v":""},{"$f":"Calculator!I664","v":""},{"$f":"Calculator!J664","v":""}]
[{"$f":"IFERROR(YEAR(Calculator!C665),\"\")","v":""},{"$f":"IFERROR(VLOOKUP(MONTH(Calculator!C665),'Month mapping'!A:B,2,0),\"\")","v":""},{"$f":"Calculator!D665","v":""},{"$f":"Calculator!E665","v":""},{"$f":"Calculator!G665","v":""},{"$f":"Calculator!H665","v":""},{"$f":"Calculator!I665","v":""},{"$f":"Calculator!J665","v":""}]
[{"$f":"IFERROR(YEAR(Calculator!C666),\"\")","v":""},{"$f":"IFERROR(VLOOKUP(MONTH(Calculator!C666),'Month mapping'!A:B,2,0),\"\")","v":""},{"$f":"Calculator!D666","v":""},{"$f":"Calculator!E666","v":""},{"$f":"Calculator!G666","v":""},{"$f":"Calculator!H666","v":""},{"$f":"Calculator!I666","v":""},{"$f":"Calculator!J666","v":""}]
[{"$f":"IFERROR(YEAR(Calculator!C667),\"\")","v":""},{"$f":"IFERROR(VLOOKUP(MONTH(Calculator!C667),'Month mapping'!A:B,2,0),\"\")","v":""},{"$f":"Calculator!D667","v":""},{"$f":"Calculator!E667","v":""},{"$f":"Calculator!G667","v":""},{"$f":"Calculator!H667","v":""},{"$f":"Calculator!I667","v":""},{"$f":"Calculator!J667","v":""}]
[{"$f":"IFERROR(YEAR(Calculator!C668),\"\")","v":""},{"$f":"IFERROR(VLOOKUP(MONTH(Calculator!C668),'Month mapping'!A:B,2,0),\"\")","v":""},{"$f":"Calculator!D668","v":""},{"$f":"Calculator!E668","v":""},{"$f":"Calculator!G668","v":""},{"$f":"Calculator!H668","v":""},{"$f":"Calculator!I668","v":""},{"$f":"Calculator!J668","v":""}]
[{"$f":"IFERROR(YEAR(Calculator!C669),\"\")","v":""},{"$f":"IFERROR(VLOOKUP(MONTH(Calculator!C669),'Month mapping'!A:B,2,0),\"\")","v":""},{"$f":"Calculator!D669","v":""},{"$f":"Calculator!E669","v":""},{"$f":"Calculator!G669","v":""},{"$f":"Calculator!H669","v":""},{"$f":"Calculator!I669","v":""},{"$f":"Calculator!J669","v":""}]
[{"$f":"IFERROR(YEAR(Calculator!C670),\"\")","v":""},{"$f":"IFERROR(VLOOKUP(MONTH(Calculator!C670),'Month mapping'!A:B,2,0),\"\")","v":""},{"$f":"Calculator!D670","v":""},{"$f":"Calculator!E670","v":""},{"$f":"Calculator!G670","v":""},{"$f":"Calculator!H670","v":""},{"$f":"Calculator!I670","v":""},{"$f":"Calculator!J670","v":""}]
[{"$f":"IFERROR(YEAR(Calculator!C671),\"\")","v":""},{"$f":"IFERROR(VLOOKUP(MONTH(Calculator!C671),'Month mapping'!A:B,2,0),\"\")","v":""},{"$f":"Calculator!D671","v":""},{"$f":"Calculator!E671","v":""},{"$f":"Calculator!G671","v":""},{"$f":"Calculator!H671","v":""},{"$f":"Calculator!I671","v":""},{"$f":"Calculator!J671","v":""}]
[{"$f":"IFERROR(YEAR(Calculator!C672),\"\")","v":""},{"$f":"IFERROR(VLOOKUP(MONTH(Calculator!C672),'Month mapping'!A:B,2,0),\"\")","v":""},{"$f":"Calculator!D672","v":""},{"$f":"Calculator!E672","v":""},{"$f":"Calculator!G672","v":""},{"$f":"Calculator!H672","v":""},{"$f":"Calculator!I672","v":""},{"$f":"Calculator!J672","v":""}]
[{"$f":"IFERROR(YEAR(Calculator!C673),\"\")","v":""},{"$f":"IFERROR(VLOOKUP(MONTH(Calculator!C673),'Month mapping'!A:B,2,0),\"\")","v":""},{"$f":"Calculator!D673","v":""},{"$f":"Calculator!E673","v":""},{"$f":"Calculator!G673","v":""},{"$f":"Calculator!H673","v":""},{"$f":"Calculator!I673","v":""},{"$f":"Calculator!J673","v":""}]
[{"$f":"IFERROR(YEAR(Calculator!C674),\"\")","v":""},{"$f":"IFERROR(VLOOKUP(MONTH(Calculator!C674),'Month mapping'!A:B,2,0),\"\")","v":""},{"$f":"Calculator!D674","v":""},{"$f":"Calculator!E674","v":""},{"$f":"Calculator!G674","v":""},{"$f":"Calculator!H674","v":""},{"$f":"Calculator!I674","v":""},{"$f":"Calculator!J674","v":""}]
[{"$f":"IFERROR(YEAR(Calculator!C675),\"\")","v":""},{"$f":"IFERROR(VLOOKUP(MONTH(Calculator!C675),'Month mapping'!A:B,2,0),\"\")","v":""},{"$f":"Calculator!D675","v":""},{"$f":"Calculator!E675","v":""},{"$f":"Calculator!G675","v":""},{"$f":"Calculator!H675","v":""},{"$f":"Calculator!I675","v":""},{"$f":"Calculator!J675","v":""}]
[{"$f":"IFERROR(YEAR(Calculator!C676),\"\")","v":""},{"$f":"IFERROR(VLOOKUP(MONTH(Calculator!C676),'Month mapping'!A:B,2,0),\"\")","v":""},{"$f":"Calculator!D676","v":""},{"$f":"Calculator!E676","v":""},{"$f":"Calculator!G676","v":""},{"$f":"Calculator!H676","v":""},{"$f":"Calculator!I676","v":""},{"$f":"Calculator!J676","v":""}]
[{"$f":"IFERROR(YEAR(Calculator!C677),\"\")","v":""},{"$f":"IFERROR(VLOOKUP(MONTH(Calculator!C677),'Month mapping'!A:B,2,0),\"\")","v":""},{"$f":"Calculator!D677","v":""},{"$f":"Calculator!E677","v":""},{"$f":"Calculator!G677","v":""},{"$f":"Calculator!H677","v":""},{"$f":"Calculator!I677","v":""},{"$f":"Calculator!J677","v":""}]
[{"$f":"IFERROR(YEAR(Calculator!C678),\"\")","v":""},{"$f":"IFERROR(VLOOKUP(MONTH(Calculator!C678),'Month mapping'!A:B,2,0),\"\")","v":""},{"$f":"Calculator!D678","v":""},{"$f":"Calculator!E678","v":""},{"$f":"Calculator!G678","v":""},{"$f":"Calculator!H678","v":""},{"$f":"Calculator!I678","v":""},{"$f":"Calculator!J678","v":""}]
[{"$f":"IFERROR(YEAR(Calculator!C679),\"\")","v":""},{"$f":"IFERROR(VLOOKUP(MONTH(Calculator!C679),'Month mapping'!A:B,2,0),\"\")","v":""},{"$f":"Calculator!D679","v":""},{"$f":"Calculator!E679","v":""},{"$f":"Calculator!G679","v":""},{"$f":"Calculator!H679","v":""},{"$f":"Calculator!I679","v":""},{"$f":"Calculator!J679","v":""}]
[{"$f":"IFERROR(YEAR(Calculator!C680),\"\")","v":""},{"$f":"IFERROR(VLOOKUP(MONTH(Calculator!C680),'Month mapping'!A:B,2,0),\"\")","v":""},{"$f":"Calculator!D680","v":""},{"$f":"Calculator!E680","v":""},{"$f":"Calculator!G680","v":""},{"$f":"Calculator!H680","v":""},{"$f":"Calculator!I680","v":""},{"$f":"Calculator!J680","v":""}]
[{"$f":"IFERROR(YEAR(Calculator!C681),\"\")","v":""},{"$f":"IFERROR(VLOOKUP(MONTH(Calculator!C681),'Month mapping'!A:B,2,0),\"\")","v":""},{"$f":"Calculator!D681","v":""},{"$f":"Calculator!E681","v":""},{"$f":"Calculator!G681","v":""},{"$f":"Calculator!H681","v":""},{"$f":"Calculator!I681","v":""},{"$f":"Calculator!J681","v":""}]
[{"$f":"IFERROR(YEAR(Calculator!C682),\"\")","v":""},{"$f":"IFERROR(VLOOKUP(MONTH(Calculator!C682),'Month mapping'!A:B,2,0),\"\")","v":""},{"$f":"Calculator!D682","v":""},{"$f":"Calculator!E682","v":""},{"$f":"Calculator!G682","v":""},{"$f":"Calculator!H682","v":""},{"$f":"Calculator!I682","v":""},{"$f":"Calculator!J682","v":""}]
[{"$f":"IFERROR(YEAR(Calculator!C683),\"\")","v":""},{"$f":"IFERROR(VLOOKUP(MONTH(Calculator!C683),'Month mapping'!A:B,2,0),\"\")","v":""},{"$f":"Calculator!D683","v":""},{"$f":"Calculator!E683","v":""},{"$f":"Calculator!G683","v":""},{"$f":"Calculator!H683","v":""},{"$f":"Calculator!I683","v":""},{"$f":"Calculator!J683","v":""}]
[{"$f":"IFERROR(YEAR(Calculator!C684),\"\")","v":""},{"$f":"IFERROR(VLOOKUP(MONTH(Calculator!C684),'Month mapping'!A:B,2,0),\"\")","v":""},{"$f":"Calculator!D684","v":""},{"$f":"Calculator!E684","v":""},{"$f":"Calculator!G684","v":""},{"$f":"Calculator!H684","v":""},{"$f":"Calculator!I684","v":""},{"$f":"Calculator!J684","v":""}]
[{"$f":"IFERROR(YEAR(Calculator!C685),\"\")","v":""},{"$f":"IFERROR(VLOOKUP(MONTH(Calculator!C685),'Month mapping'!A:B,2,0),\"\")","v":""},{"$f":"Calculator!D685","v":""},{"$f":"Calculator!E685","v":""},{"$f":"Calculator!G685","v":""},{"$f":"Calculator!H685","v":""},{"$f":"Calculator!I685","v":""},{"$f":"Calculator!J685","v":""}]
[{"$f":"IFERROR(YEAR(Calculator!C686),\"\")","v":""},{"$f":"IFERROR(VLOOKUP(MONTH(Calculator!C686),'Month mapping'!A:B,2,0),\"\")","v":""},{"$f":"Calculator!D686","v":""},{"$f":"Calculator!E686","v":""},{"$f":"Calculator!G686","v":""},{"$f":"Calculator!H686","v":""},{"$f":"Calculator!I686","v":""},{"$f":"Calculator!J686","v":""}]
[{"$f":"IFERROR(YEAR(Calculator!C687),\"\")","v":""},{"$f":"IFERROR(VLOOKUP(MONTH(Calculator!C687),'Month mapping'!A:B,2,0),\"\")","v":""},{"$f":"Calculator!D687","v":""},{"$f":"Calculator!E687","v":""},{"$f":"Calculator!G687","v":""},{"$f":"Calculator!H687","v":""},{"$f":"Calculator!I687","v":""},{"$f":"Calculator!J687","v":""}]
[{"$f":"IFERROR(YEAR(Calculator!C688),\"\")","v":""},{"$f":"IFERROR(VLOOKUP(MONTH(Calculator!C688),'Month mapping'!A:B,2,0),\"\")","v":""},{"$f":"Calculator!D688","v":""},{"$f":"Calculator!E688","v":""},{"$f":"Calculator!G688","v":""},{"$f":"Calculator!H688","v":""},{"$f":"Calculator!I688","v":""},{"$f":"Calculator!J688","v":""}]
[{"$f":"IFERROR(YEAR(Calculator!C689),\"\")","v":""},{"$f":"IFERROR(VLOOKUP(MONTH(Calculator!C689),'Month mapping'!A:B,2,0),\"\")","v":""},{"$f":"Calculator!D689","v":""},{"$f":"Calculator!E689","v":""},{"$f":"Calculator!G689","v":""},{"$f":"Calculator!H689","v":""},{"$f":"Calculator!I689","v":""},{"$f":"Calculator!J689","v":""}]
[{"$f":"IFERROR(YEAR(Calculator!C690),\"\")","v":""},{"$f":"IFERROR(VLOOKUP(MONTH(Calculator!C690),'Month mapping'!A:B,2,0),\"\")","v":""},{"$f":"Calculator!D690","v":""},{"$f":"Calculator!E690","v":""},{"$f":"Calculator!G690","v":""},{"$f":"Calculator!H690","v":""},{"$f":"Calculator!I690","v":""},{"$f":"Calculator!J690","v":""}]
[{"$f":"IFERROR(YEAR(Calculator!C691),\"\")","v":""},{"$f":"IFERROR(VLOOKUP(MONTH(Calculator!C691),'Month mapping'!A:B,2,0),\"\")","v":""},{"$f":"Calculator!D691","v":""},{"$f":"Calculator!E691","v":""},{"$f":"Calculator!G691","v":""},{"$f":"Calculator!H691","v":""},{"$f":"Calculator!I691","v":""},{"$f":"Calculator!J691","v":""}]
[{"$f":"IFERROR(YEAR(Calculator!C692),\"\")","v":""},{"$f":"IFERROR(VLOOKUP(MONTH(Calculator!C692),'Month mapping'!A:B,2,0),\"\")","v":""},{"$f":"Calculator!D692","v":""},{"$f":"Calculator!E692","v":""},{"$f":"Calculator!G692","v":""},{"$f":"Calculator!H692","v":""},{"$f":"Calculator!I692","v":""},{"$f":"Calculator!J692","v":""}]
[{"$f":"IFERROR(YEAR(Calculator!C693),\"\")","v":""},{"$f":"IFERROR(VLOOKUP(MONTH(Calculator!C693),'Month mapping'!A:B,2,0),\"\")","v":""},{"$f":"Calculator!D693","v":""},{"$f":"Calculator!E693","v":""},{"$f":"Calculator!G693","v":""},{"$f":"Calculator!H693","v":""},{"$f":"Calculator!I693","v":""},{"$f":"Calculator!J693","v":""}]
[{"$f":"IFERROR(YEAR(Calculator!C694),\"\")","v":""},{"$f":"IFERROR(VLOOKUP(MONTH(Calculator!C694),'Month mapping'!A:B,2,0),\"\")","v":""},{"$f":"Calculator!D694","v":""},{"$f":"Calculator!E694","v":""},{"$f":"Calculator!G694","v":""},{"$f":"Calculator!H694","v":""},{"$f":"Calculator!I694","v":""},{"$f":"Calculator!J694","v":""}]
[{"$f":"IFERROR(YEAR(Calculator!C695),\"\")","v":""},{"$f":"IFERROR(VLOOKUP(MONTH(Calculator!C695),'Month mapping'!A:B,2,0),\"\")","v":""},{"$f":"Calculator!D695","v":""},{"$f":"Calculator!E695","v":""},{"$f":"Calculator!G695","v":""},{"$f":"Calculator!H695","v":""},{"$f":"Calculator!I695","v":""},{"$f":"Calculator!J695","v":""}]
[{"$f":"IFERROR(YEAR(Calculator!C696),\"\")","v":""},{"$f":"IFERROR(VLOOKUP(MONTH(Calculator!C696),'Month mapping'!A:B,2,0),\"\")","v":""},{"$f":"Calculator!D696","v":""},{"$f":"Calculator!E696","v":""},{"$f":"Calculator!G696","v":""},{"$f":"Calculator!H696","v":""},{"$f":"Calculator!I696","v":""},{"$f":"Calculator!J696","v":""}]
[{"$f":"IFERROR(YEAR(Calculator!C697),\"\")","v":""},{"$f":"IFERROR(VLOOKUP(MONTH(Calculator!C697),'Month mapping'!A:B,2,0),\"\")","v":""},{"$f":"Calculator!D697","v":""},{"$f":"Calculator!E697","v":""},{"$f":"Calculator!G697","v":""},{"$f":"Calculator!H697","v":""},{"$f":"Calculator!I697","v":""},{"$f":"Calculator!J697","v":""}]
[{"$f":"IFERROR(YEAR(Calculator!C698),\"\")","v":""},{"$f":"IFERROR(VLOOKUP(MONTH(Calculator!C698),'Month mapping'!A:B,2,0),\"\")","v":""},{"$f":"Calculator!D698","v":""},{"$f":"Calculator!E698","v":""},{"$f":"Calculator!G698","v":""},{"$f":"Calculator!H698","v":""},{"$f":"Calculator!I698","v":""},{"$f":"Calculator!J698","v":""}]
[{"$f":"IFERROR(YEAR(Calculator!C699),\"\")","v":""},{"$f":"IFERROR(VLOOKUP(MONTH(Calculator!C699),'Month mapping'!A:B,2,0),\"\")","v":""},{"$f":"Calculator!D699","v":""},{"$f":"Calculator!E699","v":""},{"$f":"Calculator!G699","v":""},{"$f":"Calculator!H699","v":""},{"$f":"Calculator!I699","v":""},{"$f":"Calculator!J699","v":""}]
[{"$f":"IFERROR(YEAR(Calculator!C700),\"\")","v":""},{"$f":"IFERROR(VLOOKUP(MONTH(Calculator!C700),'Month mapping'!A:B,2,0),\"\")","v":""},{"$f":"Calculator!D700","v":""},{"$f":"Calculator!E700","v":""},{"$f":"Calculator!G700","v":""},{"$f":"Calculator!H700","v":""},{"$f":"Calculator!I700","v":""},{"$f":"Calculator!J700","v":""}]
[{"$f":"IFERROR(YEAR(Calculator!C701),\"\")","v":""},{"$f":"IFERROR(VLOOKUP(MONTH(Calculator!C701),'Month mapping'!A:B,2,0),\"\")","v":""},{"$f":"Calculator!D701","v":""},{"$f":"Calculator!E701","v":""},{"$f":"Calculator!G701","v":""},{"$f":"Calculator!H701","v":""},{"$f":"Calculator!I701","v":""},{"$f":"Calculator!J701","v":""}]
[{"$f":"IFERROR(YEAR(Calculator!C702),\"\")","v":""},{"$f":"IFERROR(VLOOKUP(MONTH(Calculator!C702),'Month mapping'!A:B,2,0),\"\")","v":""},{"$f":"Calculator!D702","v":""},{"$f":"Calculator!E702","v":""},{"$f":"Calculator!G702","v":""},{"$f":"Calculator!H702","v":""},{"$f":"Calculator!I702","v":""},{"$f":"Calculator!J702","v":""}]
[{"$f":"IFERROR(YEAR(Calculator!C703),\"\")","v":""},{"$f":"IFERROR(VLOOKUP(MONTH(Calculator!C703),'Month mapping'!A:B,2,0),\"\")","v":""},{"$f":"Calculator!D703","v":""},{"$f":"Calculator!E703","v":""},{"$f":"Calculator!G703","v":""},{"$f":"Calculator!H703","v":""},{"$f":"Calculator!I703","v":""},{"$f":"Calculator!J703","v":""}]
[{"$f":"IFERROR(YEAR(Calculator!C704),\"\")","v":""},{"$f":"IFERROR(VLOOKUP(MONTH(Calculator!C704),'Month mapping'!A:B,2,0),\"\")","v":""},{"$f":"Calculator!D704","v":""},{"$f":"Calculator!E704","v":""},{"$f":"Calculator!G704","v":""},{"$f":"Calculator!H704","v":""},{"$f":"Calculator!I704","v":""},{"$f":"Calculator!J704","v":""}]
[{"$f":"IFERROR(YEAR(Calculator!C705),\"\")","v":""},{"$f":"IFERROR(VLOOKUP(MONTH(Calculator!C705),'Month mapping'!A:B,2,0),\"\")","v":""},{"$f":"Calculator!D705","v":""},{"$f":"Calculator!E705","v":""},{"$f":"Calculator!G705","v":""},{"$f":"Calculator!H705","v":""},{"$f":"Calculator!I705","v":""},{"$f":"Calculator!J705","v":""}]
[{"$f":"IFERROR(YEAR(Calculator!C706),\"\")","v":""},{"$f":"IFERROR(VLOOKUP(MONTH(Calculator!C706),'Month mapping'!A:B,2,0),\"\")","v":""},{"$f":"Calculator!D706","v":""},{"$f":"Calculator!E706","v":""},{"$f":"Calculator!G706","v":""},{"$f":"Calculator!H706","v":""},{"$f":"Calculator!I706","v":""},{"$f":"Calculator!J706","v":""}]
[{"$f":"IFERROR(YEAR(Calculator!C707),\"\")","v":""},{"$f":"IFERROR(VLOOKUP(MONTH(Calculator!C707),'Month mapping'!A:B,2,0),\"\")","v":""},{"$f":"Calculator!D707","v":""},{"$f":"Calculator!E707","v":""},{"$f":"Calculator!G707","v":""},{"$f":"Calculator!H707","v":""},{"$f":"Calculator!I707","v":""},{"$f":"Calculator!J707","v":""}]
[{"$f":"IFERROR(YEAR(Calculator!C708),\"\")","v":""},{"$f":"IFERROR(VLOOKUP(MONTH(Calculator!C708),'Month mapping'!A:B,2,0),\"\")","v":""},{"$f":"Calculator!D708","v":""},{"$f":"Calculator!E708","v":""},{"$f":"Calculator!G708","v":""},{"$f":"Calculator!H708","v":""},{"$f":"Calculator!I708","v":""},{"$f":"Calculator!J708","v":""}]
[{"$f":"IFERROR(YEAR(Calculator!C709),\"\")","v":""},{"$f":"IFERROR(VLOOKUP(MONTH(Calculator!C709),'Month mapping'!A:B,2,0),\"\")","v":""},{"$f":"Calculator!D709","v":""},{"$f":"Calculator!E709","v":""},{"$f":"Calculator!G709","v":""},{"$f":"Calculator!H709","v":""},{"$f":"Calculator!I709","v":""},{"$f":"Calculator!J709","v":""}]
[{"$f":"IFERROR(YEAR(Calculator!C710),\"\")","v":""},{"$f":"IFERROR(VLOOKUP(MONTH(Calculator!C710),'Month mapping'!A:B,2,0),\"\")","v":""},{"$f":"Calculator!D710","v":""},{"$f":"Calculator!E710","v":""},{"$f":"Calculator!G710","v":""},{"$f":"Calculator!H710","v":""},{"$f":"Calculator!I710","v":""},{"$f":"Calculator!J710","v":""}]
[{"$f":"IFERROR(YEAR(Calculator!C711),\"\")","v":""},{"$f":"IFERROR(VLOOKUP(MONTH(Calculator!C711),'Month mapping'!A:B,2,0),\"\")","v":""},{"$f":"Calculator!D711","v":""},{"$f":"Calculator!E711","v":""},{"$f":"Calculator!G711","v":""},{"$f":"Calculator!H711","v":""},{"$f":"Calculator!I711","v":""},{"$f":"Calculator!J711","v":""}]
[{"$f":"IFERROR(YEAR(Calculator!C712),\"\")","v":""},{"$f":"IFERROR(VLOOKUP(MONTH(Calculator!C712),'Month mapping'!A:B,2,0),\"\")","v":""},{"$f":"Calculator!D712","v":""},{"$f":"Calculator!E712","v":""},{"$f":"Calculator!G712","v":""},{"$f":"Calculator!H712","v":""},{"$f":"Calculator!I712","v":""},{"$f":"Calculator!J712","v":""}]
[{"$f":"IFERROR(YEAR(Calculator!C713),\"\")","v":""},{"$f":"IFERROR(VLOOKUP(MONTH(Calculator!C713),'Month mapping'!A:B,2,0),\"\")","v":""},{"$f":"Calculator!D713","v":""},{"$f":"Calculator!E713","v":""},{"$f":"Calculator!G713","v":""},{"$f":"Calculator!H713","v":""},{"$f":"Calculator!I713","v":""},{"$f":"Calculator!J713","v":""}]
[{"$f":"IFERROR(YEAR(Calculator!C714),\"\")","v":""},{"$f":"IFERROR(VLOOKUP(MONTH(Calculator!C714),'Month mapping'!A:B,2,0),\"\")","v":""},{"$f":"Calculator!D714","v":""},{"$f":"Calculator!E714","v":""},{"$f":"Calculator!G714","v":""},{"$f":"Calculator!H714","v":""},{"$f":"Calculator!I714","v":""},{"$f":"Calculator!J714","v":""}]
[{"$f":"IFERROR(YEAR(Calculator!C715),\"\")","v":""},{"$f":"IFERROR(VLOOKUP(MONTH(Calculator!C715),'Month mapping'!A:B,2,0),\"\")","v":""},{"$f":"Calculator!D715","v":""},{"$f":"Calculator!E715","v":""},{"$f":"Calculator!G715","v":""},{"$f":"Calculator!H715","v":""},{"$f":"Calculator!I715","v":""},{"$f":"Calculator!J715","v":""}]
[{"$f":"IFERROR(YEAR(Calculator!C716),\"\")","v":""},{"$f":"IFERROR(VLOOKUP(MONTH(Calculator!C716),'Month mapping'!A:B,2,0),\"\")","v":""},{"$f":"Calculator!D716","v":""},{"$f":"Calculator!E716","v":""},{"$f":"Calculator!G716","v":""},{"$f":"Calculator!H716","v":""},{"$f":"Calculator!I716","v":""},{"$f":"Calculator!J716","v":""}]
[{"$f":"IFERROR(YEAR(Calculator!C717),\"\")","v":""},{"$f":"IFERROR(VLOOKUP(MONTH(Calculator!C717),'Month mapping'!A:B,2,0),\"\")","v":""},{"$f":"Calculator!D717","v":""},{"$f":"Calculator!E717","v":""},{"$f":"Calculator!G717","v":""},{"$f":"Calculator!H717","v":""},{"$f":"Calculator!I717","v":""},{"$f":"Calculator!J717","v":""}]
[{"$f":"IFERROR(YEAR(Calculator!C718),\"\")","v":""},{"$f":"IFERROR(VLOOKUP(MONTH(Calculator!C718),'Month mapping'!A:B,2,0),\"\")","v":""},{"$f":"Calculator!D718","v":""},{"$f":"Calculator!E718","v":""},{"$f":"Calculator!G718","v":""},{"$f":"Calculator!H718","v":""},{"$f":"Calculator!I718","v":""},{"$f":"Calculator!J718","v":""}]
[{"$f":"IFERROR(YEAR(Calculator!C719),\"\")","v":""},{"$f":"IFERROR(VLOOKUP(MONTH(Calculator!C719),'Month mapping'!A:B,2,0),\"\")","v":""},{"$f":"Calculator!D719","v":""},{"$f":"Calculator!E719","v":""},{"$f":"Calculator!G719","v":""},{"$f":"Calculator!H719","v":""},{"$f":"Calculator!I719","v":""},{"$f":"Calculator!J719","v":""}]
[{"$f":"IFERROR(YEAR(Calculator!C720),\"\")","v":""},{"$f":"IFERROR(VLOOKUP(MONTH(Calculator!C720),'Month mapping'!A:B,2,0),\"\")","v":""},{"$f":"Calculator!D720","v":""},{"$f":"Calculator!E720","v":""},{"$f":"Calculator!G720","v":""},{"$f":"Calculator!H720","v":""},{"$f":"Calculator!I720","v":""},{"$f":"Calculator!J720","v":""}]
[{"$f":"IFERROR(YEAR(Calculator!C721),\"\")","v":""},{"$f":"IFERROR(VLOOKUP(MONTH(Calculator!C721),'Month mapping'!A:B,2,0),\"\")","v":""},{"$f":"Calculator!D721","v":""},{"$f":"Calculator!E721","v":""},{"$f":"Calculator!G721","v":""},{"$f":"Calculator!H721","v":""},{"$f":"Calculator!I721","v":""},{"$f":"Calculator!J721","v":""}]
[{"$f":"IFERROR(YEAR(Calculator!C722),\"\")","v":""},{"$f":"IFERROR(VLOOKUP(MONTH(Calculator!C722),'Month mapping'!A:B,2,0),\"\")","v":""},{"$f":"Calculator!D722","v":""},{"$f":"Calculator!E722","v":""},{"$f":"Calculator!G722","v":""},{"$f":"Calculator!H722","v":""},{"$f":"Calculator!I722","v":""},{"$f":"Calculator!J722","v":""}]
[{"$f":"IFERROR(YEAR(Calculator!C723),\"\")","v":""},{"$f":"IFERROR(VLOOKUP(MONTH(Calculator!C723),'Month mapping'!A:B,2,0),\"\")","v":""},{"$f":"Calculator!D723","v":""},{"$f":"Calculator!E723","v":""},{"$f":"Calculator!G723","v":""},{"$f":"Calculator!H723","v":""},{"$f":"Calculator!I723","v":""},{"$f":"Calculator!J723","v":""}]
[{"$f":"IFERROR(YEAR(Calculator!C724),\"\")","v":""},{"$f":"IFERROR(VLOOKUP(MONTH(Calculator!C724),'Month mapping'!A:B,2,0),\"\")","v":""},{"$f":"Calculator!D724","v":""},{"$f":"Calculator!E724","v":""},{"$f":"Calculator!G724","v":""},{"$f":"Calculator!H724","v":""},{"$f":"Calculator!I724","v":""},{"$f":"Calculator!J724","v":""}]
[{"$f":"IFERROR(YEAR(Calculator!C725),\"\")","v":""},{"$f":"IFERROR(VLOOKUP(MONTH(Calculator!C725),'Month mapping'!A:B,2,0),\"\")","v":""},{"$f":"Calculator!D725","v":""},{"$f":"Calculator!E725","v":""},{"$f":"Calculator!G725","v":""},{"$f":"Calculator!H725","v":""},{"$f":"Calculator!I725","v":""},{"$f":"Calculator!J725","v":""}]
[{"$f":"IFERROR(YEAR(Calculator!C726),\"\")","v":""},{"$f":"IFERROR(VLOOKUP(MONTH(Calculator!C726),'Month mapping'!A:B,2,0),\"\")","v":""},{"$f":"Calculator!D726","v":""},{"$f":"Calculator!E726","v":""},{"$f":"Calculator!G726","v":""},{"$f":"Calculator!H726","v":""},{"$f":"Calculator!I726","v":""},{"$f":"Calculator!J726","v":""}]
[{"$f":"IFERROR(YEAR(Calculator!C727),\"\")","v":""},{"$f":"IFERROR(VLOOKUP(MONTH(Calculator!C727),'Month mapping'!A:B,2,0),\"\")","v":""},{"$f":"Calculator!D727","v":""},{"$f":"Calculator!E727","v":""},{"$f":"Calculator!G727","v":""},{"$f":"Calculator!H727","v":""},{"$f":"Calculator!I727","v":""},{"$f":"Calculator!J727","v":""}]
[{"$f":"IFERROR(YEAR(Calculator!C728),\"\")","v":""},{"$f":"IFERROR(VLOOKUP(MONTH(Calculator!C728),'Month mapping'!A:B,2,0),\"\")","v":""},{"$f":"Calculator!D728","v":""},{"$f":"Calculator!E728","v":""},{"$f":"Calculator!G728","v":""},{"$f":"Calculator!H728","v":""},{"$f":"Calculator!I728","v":""},{"$f":"Calculator!J728","v":""}]
[{"$f":"IFERROR(YEAR(Calculator!C729),\"\")","v":""},{"$f":"IFERROR(VLOOKUP(MONTH(Calculator!C729),'Month mapping'!A:B,2,0),\"\")","v":""},{"$f":"Calculator!D729","v":""},{"$f":"Calculator!E729","v":""},{"$f":"Calculator!G729","v":""},{"$f":"Calculator!H729","v":""},{"$f":"Calculator!I729","v":""},{"$f":"Calculator!J729","v":""}]
[{"$f":"IFERROR(YEAR(Calculator!C730),\"\")","v":""},{"$f":"IFERROR(VLOOKUP(MONTH(Calculator!C730),'Month mapping'!A:B,2,0),\"\")","v":""},{"$f":"Calculator!D730","v":""},{"$f":"Calculator!E730","v":""},{"$f":"Calculator!G730","v":""},{"$f":"Calculator!H730","v":""},{"$f":"Calculator!I730","v":""},{"$f":"Calculator!J730","v":""}]
[{"$f":"IFERROR(YEAR(Calculator!C731),\"\")","v":""},{"$f":"IFERROR(VLOOKUP(MONTH(Calculator!C731),'Month mapping'!A:B,2,0),\"\")","v":""},{"$f":"Calculator!D731","v":""},{"$f":"Calculator!E731","v":""},{"$f":"Calculator!G731","v":""},{"$f":"Calculator!H731","v":""},{"$f":"Calculator!I731","v":""},{"$f":"Calculator!J731","v":""}]
[{"$f":"IFERROR(YEAR(Calculator!C732),\"\")","v":""},{"$f":"IFERROR(VLOOKUP(MONTH(Calculator!C732),'Month mapping'!A:B,2,0),\"\")","v":""},{"$f":"Calculator!D732","v":""},{"$f":"Calculator!E732","v":""},{"$f":"Calculator!G732","v":""},{"$f":"Calculator!H732","v":""},{"$f":"Calculator!I732","v":""},{"$f":"Calculator!J732","v":""}]
[{"$f":"IFERROR(YEAR(Calculator!C733),\"\")","v":""},{"$f":"IFERROR(VLOOKUP(MONTH(Calculator!C733),'Month mapping'!A:B,2,0),\"\")","v":""},{"$f":"Calculator!D733","v":""},{"$f":"Calculator!E733","v":""},{"$f":"Calculator!G733","v":""},{"$f":"Calculator!H733","v":""},{"$f":"Calculator!I733","v":""},{"$f":"Calculator!J733","v":""}]
[{"$f":"IFERROR(YEAR(Calculator!C734),\"\")","v":""},{"$f":"IFERROR(VLOOKUP(MONTH(Calculator!C734),'Month mapping'!A:B,2,0),\"\")","v":""},{"$f":"Calculator!D734","v":""},{"$f":"Calculator!E734","v":""},{"$f":"Calculator!G734","v":""},{"$f":"Calculator!H734","v":""},{"$f":"Calculator!I734","v":""},{"$f":"Calculator!J734","v":""}]
[{"$f":"IFERROR(YEAR(Calculator!C735),\"\")","v":""},{"$f":"IFERROR(VLOOKUP(MONTH(Calculator!C735),'Month mapping'!A:B,2,0),\"\")","v":""},{"$f":"Calculator!D735","v":""},{"$f":"Calculator!E735","v":""},{"$f":"Calculator!G735","v":""},{"$f":"Calculator!H735","v":""},{"$f":"Calculator!I735","v":""},{"$f":"Calculator!J735","v":""}]
[{"$f":"IFERROR(YEAR(Calculator!C736),\"\")","v":""},{"$f":"IFERROR(VLOOKUP(MONTH(Calculator!C736),'Month mapping'!A:B,2,0),\"\")","v":""},{"$f":"Calculator!D736","v":""},{"$f":"Calculator!E736","v":""},{"$f":"Calculator!G736","v":""},{"$f":"Calculator!H736","v":""},{"$f":"Calculator!I736","v":""},{"$f":"Calculator!J736","v":""}]
[{"$f":"IFERROR(YEAR(Calculator!C737),\"\")","v":""},{"$f":"IFERROR(VLOOKUP(MONTH(Calculator!C737),'Month mapping'!A:B,2,0),\"\")","v":""},{"$f":"Calculator!D737","v":""},{"$f":"Calculator!E737","v":""},{"$f":"Calculator!G737","v":""},{"$f":"Calculator!H737","v":""},{"$f":"Calculator!I737","v":""},{"$f":"Calculator!J737","v":""}]
[{"$f":"IFERROR(YEAR(Calculator!C738),\"\")","v":""},{"$f":"IFERROR(VLOOKUP(MONTH(Calculator!C738),'Month mapping'!A:B,2,0),\"\")","v":""},{"$f":"Calculator!D738","v":""},{"$f":"Calculator!E738","v":""},{"$f":"Calculator!G738","v":""},{"$f":"Calculator!H738","v":""},{"$f":"Calculator!I738","v":""},{"$f":"Calculator!J738","v":""}]
[{"$f":"IFERROR(YEAR(Calculator!C739),\"\")","v":""},{"$f":"IFERROR(VLOOKUP(MONTH(Calculator!C739),'Month mapping'!A:B,2,0),\"\")","v":""},{"$f":"Calculator!D739","v":""},{"$f":"Calculator!E739","v":""},{"$f":"Calculator!G739","v":""},{"$f":"Calculator!H739","v":""},{"$f":"Calculator!I739","v":""},{"$f":"Calculator!J739","v":""}]
[{"$f":"IFERROR(YEAR(Calculator!C740),\"\")","v":""},{"$f":"IFERROR(VLOOKUP(MONTH(Calculator!C740),'Month mapping'!A:B,2,0),\"\")","v":""},{"$f":"Calculator!D740","v":""},{"$f":"Calculator!E740","v":""},{"$f":"Calculator!G740","v":""},{"$f":"Calculator!H740","v":""},{"$f":"Calculator!I740","v":""},{"$f":"Calculator!J740","v":""}]
[{"$f":"IFERROR(YEAR(Calculator!C741),\"\")","v":""},{"$f":"IFERROR(VLOOKUP(MONTH(Calculator!C741),'Month mapping'!A:B,2,0),\"\")","v":""},{"$f":"Calculator!D741","v":""},{"$f":"Calculator!E741","v":""},{"$f":"Calculator!G741","v":""},{"$f":"Calculator!H741","v":""},{"$f":"Calculator!I741","v":""},{"$f":"Calculator!J741","v":""}]
[{"$f":"IFERROR(YEAR(Calculator!C742),\"\")","v":""},{"$f":"IFERROR(VLOOKUP(MONTH(Calculator!C742),'Month mapping'!A:B,2,0),\"\")","v":""},{"$f":"Calculator!D742","v":""},{"$f":"Calculator!E742","v":""},{"$f":"Calculator!G742","v":""},{"$f":"Calculator!H742","v":""},{"$f":"Calculator!I742","v":""},{"$f":"Calculator!J742","v":""}]
[{"$f":"IFERROR(YEAR(Calculator!C743),\"\")","v":""},{"$f":"IFERROR(VLOOKUP(MONTH(Calculator!C743),'Month mapping'!A:B,2,0),\"\")","v":""},{"$f":"Calculator!D743","v":""},{"$f":"Calculator!E743","v":""},{"$f":"Calculator!G743","v":""},{"$f":"Calculator!H743","v":""},{"$f":"Calculator!I743","v":""},{"$f":"Calculator!J743","v":""}]
[{"$f":"IFERROR(YEAR(Calculator!C744),\"\")","v":""},{"$f":"IFERROR(VLOOKUP(MONTH(Calculator!C744),'Month mapping'!A:B,2,0),\"\")","v":""},{"$f":"Calculator!D744","v":""},{"$f":"Calculator!E744","v":""},{"$f":"Calculator!G744","v":""},{"$f":"Calculator!H744","v":""},{"$f":"Calculator!I744","v":""},{"$f":"Calculator!J744","v":""}]
[{"$f":"IFERROR(YEAR(Calculator!C745),\"\")","v":""},{"$f":"IFERROR(VLOOKUP(MONTH(Calculator!C745),'Month mapping'!A:B,2,0),\"\")","v":""},{"$f":"Calculator!D745","v":""},{"$f":"Calculator!E745","v":""},{"$f":"Calculator!G745","v":""},{"$f":"Calculator!H745","v":""},{"$f":"Calculator!I745","v":""},{"$f":"Calculator!J745","v":""}]
[{"$f":"IFERROR(YEAR(Calculator!C746),\"\")","v":""},{"$f":"IFERROR(VLOOKUP(MONTH(Calculator!C746),'Month mapping'!A:B,2,0),\"\")","v":""},{"$f":"Calculator!D746","v":""},{"$f":"Calculator!E746","v":""},{"$f":"Calculator!G746","v":""},{"$f":"Calculator!H746","v":""},{"$f":"Calculator!I746","v":""},{"$f":"Calculator!J746","v":""}]
[{"$f":"IFERROR(YEAR(Calculator!C747),\"\")","v":""},{"$f":"IFERROR(VLOOKUP(MONTH(Calculator!C747),'Month mapping'!A:B,2,0),\"\")","v":""},{"$f":"Calculator!D747","v":""},{"$f":"Calculator!E747","v":""},{"$f":"Calculator!G747","v":""},{"$f":"Calculator!H747","v":""},{"$f":"Calculator!I747","v":""},{"$f":"Calculator!J747","v":""}]
[{"$f":"IFERROR(YEAR(Calculator!C748),\"\")","v":""},{"$f":"IFERROR(VLOOKUP(MONTH(Calculator!C748),'Month mapping'!A:B,2,0),\"\")","v":""},{"$f":"Calculator!D748","v":""},{"$f":"Calculator!E748","v":""},{"$f":"Calculator!G748","v":""},{"$f":"Calculator!H748","v":""},{"$f":"Calculator!I748","v":""},{"$f":"Calculator!J748","v":""}]
[{"$f":"IFERROR(YEAR(Calculator!C749),\"\")","v":""},{"$f":"IFERROR(VLOOKUP(MONTH(Calculator!C749),'Month mapping'!A:B,2,0),\"\")","v":""},{"$f":"Calculator!D749","v":""},{"$f":"Calculator!E749","v":""},{"$f":"Calculator!G749","v":""},{"$f":"Calculator!H749","v":""},{"$f":"Calculator!I749","v":""},{"$f":"Calculator!J749","v":""}]
[{"$f":"IFERROR(YEAR(Calculator!C750),\"\")","v":""},{"$f":"IFERROR(VLOOKUP(MONTH(Calculator!C750),'Month mapping'!A:B,2,0),\"\")","v":""},{"$f":"Calculator!D750","v":""},{"$f":"Calculator!E750","v":""},{"$f":"Calculator!G750","v":""},{"$f":"Calculator!H750","v":""},{"$f":"Calculator!I750","v":""},{"$f":"Calculator!J750","v":""}]
[{"$f":"IFERROR(YEAR(Calculator!C751),\"\")","v":""},{"$f":"IFERROR(VLOOKUP(MONTH(Calculator!C751),'Month mapping'!A:B,2,0),\"\")","v":""},{"$f":"Calculator!D751","v":""},{"$f":"Calculator!E751","v":""},{"$f":"Calculator!G751","v":""},{"$f":"Calculator!H751","v":""},{"$f":"Calculator!I751","v":""},{"$f":"Calculator!J751","v":""}]
[{"$f":"IFERROR(YEAR(Calculator!C752),\"\")","v":""},{"$f":"IFERROR(VLOOKUP(MONTH(Calculator!C752),'Month mapping'!A:B,2,0),\"\")","v":""},{"$f":"Calculator!D752","v":""},{"$f":"Calculator!E752","v":""},{"$f":"Calculator!G752","v":""},{"$f":"Calculator!H752","v":""},{"$f":"Calculator!I752","v":""},{"$f":"Calculator!J752","v":""}]
[{"$f":"IFERROR(YEAR(Calculator!C753),\"\")","v":""},{"$f":"IFERROR(VLOOKUP(MONTH(Calculator!C753),'Month mapping'!A:B,2,0),\"\")","v":""},{"$f":"Calculator!D753","v":""},{"$f":"Calculator!E753","v":""},{"$f":"Calculator!G753","v":""},{"$f":"Calculator!H753","v":""},{"$f":"Calculator!I753","v":""},{"$f":"Calculator!J753","v":""}]
[{"$f":"IFERROR(YEAR(Calculator!C754),\"\")","v":""},{"$f":"IFERROR(VLOOKUP(MONTH(Calculator!C754),'Month mapping'!A:B,2,0),\"\")","v":""},{"$f":"Calculator!D754","v":""},{"$f":"Calculator!E754","v":""},{"$f":"Calculator!G754","v":""},{"$f":"Calculator!H754","v":""},{"$f":"Calculator!I754","v":""},{"$f":"Calculator!J754","v":""}]
[{"$f":"IFERROR(YEAR(Calculator!C755),\"\")","v":""},{"$f":"IFERROR(VLOOKUP(MONTH(Calculator!C755),'Month mapping'!A:B,2,0),\"\")","v":""},{"$f":"Calculator!D755","v":""},{"$f":"Calculator!E755","v":""},{"$f":"Calculator!G755","v":""},{"$f":"Calculator!H755","v":""},{"$f":"Calculator!I755","v":""},{"$f":"Calculator!J755","v":""}]
[{"$f":"IFERROR(YEAR(Calculator!C756),\"\")","v":""},{"$f":"IFERROR(VLOOKUP(MONTH(Calculator!C756),'Month mapping'!A:B,2,0),\"\")","v":""},{"$f":"Calculator!D756","v":""},{"$f":"Calculator!E756","v":""},{"$f":"Calculator!G756","v":""},{"$f":"Calculator!H756","v":""},{"$f":"Calculator!I756","v":""},{"$f":"Calculator!J756","v":""}]
[{"$f":"IFERROR(YEAR(Calculator!C757),\"\")","v":""},{"$f":"IFERROR(VLOOKUP(MONTH(Calculator!C757),'Month mapping'!A:B,2,0),\"\")","v":""},{"$f":"Calculator!D757","v":""},{"$f":"Calculator!E757","v":""},{"$f":"Calculator!G757","v":""},{"$f":"Calculator!H757","v":""},{"$f":"Calculator!I757","v":""},{"$f":"Calculator!J757","v":""}]
[{"$f":"IFERROR(YEAR(Calculator!C758),\"\")","v":""},{"$f":"IFERROR(VLOOKUP(MONTH(Calculator!C758),'Month mapping'!A:B,2,0),\"\")","v":""},{"$f":"Calculator!D758","v":""},{"$f":"Calculator!E758","v":""},{"$f":"Calculator!G758","v":""},{"$f":"Calculator!H758","v":""},{"$f":"Calculator!I758","v":""},{"$f":"Calculator!J758","v":""}]
[{"$f":"IFERROR(YEAR(Calculator!C759),\"\")","v":""},{"$f":"IFERROR(VLOOKUP(MONTH(Calculator!C759),'Month mapping'!A:B,2,0),\"\")","v":""},{"$f":"Calculator!D759","v":""},{"$f":"Calculator!E759","v":""},{"$f":"Calculator!G759","v":""},{"$f":"Calculator!H759","v":""},{"$f":"Calculator!I759","v":""},{"$f":"Calculator!J759","v":""}]
[{"$f":"IFERROR(YEAR(Calculator!C760),\"\")","v":""},{"$f":"IFERROR(VLOOKUP(MONTH(Calculator!C760),'Month mapping'!A:B,2,0),\"\")","v":""},{"$f":"Calculator!D760","v":""},{"$f":"Calculator!E760","v":""},{"$f":"Calculator!G760","v":""},{"$f":"Calculator!H760","v":""},{"$f":"Calculator!I760","v":""},{"$f":"Calculator!J760","v":""}]
[{"$f":"IFERROR(YEAR(Calculator!C761),\"\")","v":""},{"$f":"IFERROR(VLOOKUP(MONTH(Calculator!C761),'Month mapping'!A:B,2,0),\"\")","v":""},{"$f":"Calculator!D761","v":""},{"$f":"Calculator!E761","v":""},{"$f":"Calculator!G761","v":""},{"$f":"Calculator!H761","v":""},{"$f":"Calculator!I761","v":""},{"$f":"Calculator!J761","v":""}]
[{"$f":"IFERROR(YEAR(Calculator!C762),\"\")","v":""},{"$f":"IFERROR(VLOOKUP(MONTH(Calculator!C762),'Month mapping'!A:B,2,0),\"\")","v":""},{"$f":"Calculator!D762","v":""},{"$f":"Calculator!E762","v":""},{"$f":"Calculator!G762","v":""},{"$f":"Calculator!H762","v":""},{"$f":"Calculator!I762","v":""},{"$f":"Calculator!J762","v":""}]
[{"$f":"IFERROR(YEAR(Calculator!C763),\"\")","v":""},{"$f":"IFERROR(VLOOKUP(MONTH(Calculator!C763),'Month mapping'!A:B,2,0),\"\")","v":""},{"$f":"Calculator!D763","v":""},{"$f":"Calculator!E763","v":""},{"$f":"Calculator!G763","v":""},{"$f":"Calculator!H763","v":""},{"$f":"Calculator!I763","v":""},{"$f":"Calculator!J763","v":""}]
[{"$f":"IFERROR(YEAR(Calculator!C764),\"\")","v":""},{"$f":"IFERROR(VLOOKUP(MONTH(Calculator!C764),'Month mapping'!A:B,2,0),\"\")","v":""},{"$f":"Calculator!D764","v":""},{"$f":"Calculator!E764","v":""},{"$f":"Calculator!G764","v":""},{"$f":"Calculator!H764","v":""},{"$f":"Calculator!I764","v":""},{"$f":"Calculator!J764","v":""}]
[{"$f":"IFERROR(YEAR(Calculator!C765),\"\")","v":""},{"$f":"IFERROR(VLOOKUP(MONTH(Calculator!C765),'Month mapping'!A:B,2,0),\"\")","v":""},{"$f":"Calculator!D765","v":""},{"$f":"Calculator!E765","v":""},{"$f":"Calculator!G765","v":""},{"$f":"Calculator!H765","v":""},{"$f":"Calculator!I765","v":""},{"$f":"Calculator!J765","v":""}]
[{"$f":"IFERROR(YEAR(Calculator!C766),\"\")","v":""},{"$f":"IFERROR(VLOOKUP(MONTH(Calculator!C766),'Month mapping'!A:B,2,0),\"\")","v":""},{"$f":"Calculator!D766","v":""},{"$f":"Calculator!E766","v":""},{"$f":"Calculator!G766","v":""},{"$f":"Calculator!H766","v":""},{"$f":"Calculator!I766","v":""},{"$f":"Calculator!J766","v":""}]
[{"$f":"IFERROR(YEAR(Calculator!C767),\"\")","v":""},{"$f":"IFERROR(VLOOKUP(MONTH(Calculator!C767),'Month mapping'!A:B,2,0),\"\")","v":""},{"$f":"Calculator!D767","v":""},{"$f":"Calculator!E767","v":""},{"$f":"Calculator!G767","v":""},{"$f":"Calculator!H767","v":""},{"$f":"Calculator!I767","v":""},{"$f":"Calculator!J767","v":""}]
[{"$f":"IFERROR(YEAR(Calculator!C768),\"\")","v":""},{"$f":"IFERROR(VLOOKUP(MONTH(Calculator!C768),'Month mapping'!A:B,2,0),\"\")","v":""},{"$f":"Calculator!D768","v":""},{"$f":"Calculator!E768","v":""},{"$f":"Calculator!G768","v":""},{"$f":"Calculator!H768","v":""},{"$f":"Calculator!I768","v":""},{"$f":"Calculator!J768","v":""}]
[{"$f":"IFERROR(YEAR(Calculator!C769),\"\")","v":""},{"$f":"IFERROR(VLOOKUP(MONTH(Calculator!C769),'Month mapping'!A:B,2,0),\"\")","v":""},{"$f":"Calculator!D769","v":""},{"$f":"Calculator!E769","v":""},{"$f":"Calculator!G769","v":""},{"$f":"Calculator!H769","v":""},{"$f":"Calculator!I769","v":""},{"$f":"Calculator!J769","v":""}]
[{"$f":"IFERROR(YEAR(Calculator!C770),\"\")","v":""},{"$f":"IFERROR(VLOOKUP(MONTH(Calculator!C770),'Month mapping'!A:B,2,0),\"\")","v":""},{"$f":"Calculator!D770","v":""},{"$f":"Calculator!E770","v":""},{"$f":"Calculator!G770","v":""},{"$f":"Calculator!H770","v":""},{"$f":"Calculator!I770","v":""},{"$f":"Calculator!J770","v":""}]
[{"$f":"IFERROR(YEAR(Calculator!C771),\"\")","v":""},{"$f":"IFERROR(VLOOKUP(MONTH(Calculator!C771),'Month mapping'!A:B,2,0),\"\")","v":""},{"$f":"Calculator!D771","v":""},{"$f":"Calculator!E771","v":""},{"$f":"Calculator!G771","v":""},{"$f":"Calculator!H771","v":""},{"$f":"Calculator!I771","v":""},{"$f":"Calculator!J771","v":""}]
[{"$f":"IFERROR(YEAR(Calculator!C772),\"\")","v":""},{"$f":"IFERROR(VLOOKUP(MONTH(Calculator!C772),'Month mapping'!A:B,2,0),\"\")","v":""},{"$f":"Calculator!D772","v":""},{"$f":"Calculator!E772","v":""},{"$f":"Calculator!G772","v":""},{"$f":"Calculator!H772","v":""},{"$f":"Calculator!I772","v":""},{"$f":"Calculator!J772","v":""}]
[{"$f":"IFERROR(YEAR(Calculator!C773),\"\")","v":""},{"$f":"IFERROR(VLOOKUP(MONTH(Calculator!C773),'Month mapping'!A:B,2,0),\"\")","v":""},{"$f":"Calculator!D773","v":""},{"$f":"Calculator!E773","v":""},{"$f":"Calculator!G773","v":""},{"$f":"Calculator!H773","v":""},{"$f":"Calculator!I773","v":""},{"$f":"Calculator!J773","v":""}]
[{"$f":"IFERROR(YEAR(Calculator!C774),\"\")","v":""},{"$f":"IFERROR(VLOOKUP(MONTH(Calculator!C774),'Month mapping'!A:B,2,0),\"\")","v":""},{"$f":"Calculator!D774","v":""},{"$f":"Calculator!E774","v":""},{"$f":"Calculator!G774","v":""},{"$f":"Calculator!H774","v":""},{"$f":"Calculator!I774","v":""},{"$f":"Calculator!J774","v":""}]
[{"$f":"IFERROR(YEAR(Calculator!C775),\"\")","v":""},{"$f":"IFERROR(VLOOKUP(MONTH(Calculator!C775),'Month mapping'!A:B,2,0),\"\")","v":""},{"$f":"Calculator!D775","v":""},{"$f":"Calculator!E775","v":""},{"$f":"Calculator!G775","v":""},{"$f":"Calculator!H775","v":""},{"$f":"Calculator!I775","v":""},{"$f":"Calculator!J775","v":""}]
[{"$f":"IFERROR(YEAR(Calculator!C776),\"\")","v":""},{"$f":"IFERROR(VLOOKUP(MONTH(Calculator!C776),'Month mapping'!A:B,2,0),\"\")","v":""},{"$f":"Calculator!D776","v":""},{"$f":"Calculator!E776","v":""},{"$f":"Calculator!G776","v":""},{"$f":"Calculator!H776","v":""},{"$f":"Calculator!I776","v":""},{"$f":"Calculator!J776","v":""}]
[{"$f":"IFERROR(YEAR(Calculator!C777),\"\")","v":""},{"$f":"IFERROR(VLOOKUP(MONTH(Calculator!C777),'Month mapping'!A:B,2,0),\"\")","v":""},{"$f":"Calculator!D777","v":""},{"$f":"Calculator!E777","v":""},{"$f":"Calculator!G777","v":""},{"$f":"Calculator!H777","v":""},{"$f":"Calculator!I777","v":""},{"$f":"Calculator!J777","v":""}]
[{"$f":"IFERROR(YEAR(Calculator!C778),\"\")","v":""},{"$f":"IFERROR(VLOOKUP(MONTH(Calculator!C778),'Month mapping'!A:B,2,0),\"\")","v":""},{"$f":"Calculator!D778","v":""},{"$f":"Calculator!E778","v":""},{"$f":"Calculator!G778","v":""},{"$f":"Calculator!H778","v":""},{"$f":"Calculator!I778","v":""},{"$f":"Calculator!J778","v":""}]
[{"$f":"IFERROR(YEAR(Calculator!C779),\"\")","v":""},{"$f":"IFERROR(VLOOKUP(MONTH(Calculator!C779),'Month mapping'!A:B,2,0),\"\")","v":""},{"$f":"Calculator!D779","v":""},{"$f":"Calculator!E779","v":""},{"$f":"Calculator!G779","v":""},{"$f":"Calculator!H779","v":""},{"$f":"Calculator!I779","v":""},{"$f":"Calculator!J779","v":""}]
[{"$f":"IFERROR(YEAR(Calculator!C780),\"\")","v":""},{"$f":"IFERROR(VLOOKUP(MONTH(Calculator!C780),'Month mapping'!A:B,2,0),\"\")","v":""},{"$f":"Calculator!D780","v":""},{"$f":"Calculator!E780","v":""},{"$f":"Calculator!G780","v":""},{"$f":"Calculator!H780","v":""},{"$f":"Calculator!I780","v":""},{"$f":"Calculator!J780","v":""}]
[{"$f":"IFERROR(YEAR(Calculator!C781),\"\")","v":""},{"$f":"IFERROR(VLOOKUP(MONTH(Calculator!C781),'Month mapping'!A:B,2,0),\"\")","v":""},{"$f":"Calculator!D781","v":""},{"$f":"Calculator!E781","v":""},{"$f":"Calculator!G781","v":""},{"$f":"Calculator!H781","v":""},{"$f":"Calculator!I781","v":""},{"$f":"Calculator!J781","v":""}]
[{"$f":"IFERROR(YEAR(Calculator!C782),\"\")","v":""},{"$f":"IFERROR(VLOOKUP(MONTH(Calculator!C782),'Month mapping'!A:B,2,0),\"\")","v":""},{"$f":"Calculator!D782","v":""},{"$f":"Calculator!E782","v":""},{"$f":"Calculator!G782","v":""},{"$f":"Calculator!H782","v":""},{"$f":"Calculator!I782","v":""},{"$f":"Calculator!J782","v":""}]
[{"$f":"IFERROR(YEAR(Calculator!C783),\"\")","v":""},{"$f":"IFERROR(VLOOKUP(MONTH(Calculator!C783),'Month mapping'!A:B,2,0),\"\")","v":""},{"$f":"Calculator!D783","v":""},{"$f":"Calculator!E783","v":""},{"$f":"Calculator!G783","v":""},{"$f":"Calculator!H783","v":""},{"$f":"Calculator!I783","v":""},{"$f":"Calculator!J783","v":""}]
[{"$f":"IFERROR(YEAR(Calculator!C784),\"\")","v":""},{"$f":"IFERROR(VLOOKUP(MONTH(Calculator!C784),'Month mapping'!A:B,2,0),\"\")","v":""},{"$f":"Calculator!D784","v":""},{"$f":"Calculator!E784","v":""},{"$f":"Calculator!G784","v":""},{"$f":"Calculator!H784","v":""},{"$f":"Calculator!I784","v":""},{"$f":"Calculator!J784","v":""}]
[{"$f":"IFERROR(YEAR(Calculator!C785),\"\")","v":""},{"$f":"IFERROR(VLOOKUP(MONTH(Calculator!C785),'Month mapping'!A:B,2,0),\"\")","v":""},{"$f":"Calculator!D785","v":""},{"$f":"Calculator!E785","v":""},{"$f":"Calculator!G785","v":""},{"$f":"Calculator!H785","v":""},{"$f":"Calculator!I785","v":""},{"$f":"Calculator!J785","v":""}]
[{"$f":"IFERROR(YEAR(Calculator!C786),\"\")","v":""},{"$f":"IFERROR(VLOOKUP(MONTH(Calculator!C786),'Month mapping'!A:B,2,0),\"\")","v":""},{"$f":"Calculator!D786","v":""},{"$f":"Calculator!E786","v":""},{"$f":"Calculator!G786","v":""},{"$f":"Calculator!H786","v":""},{"$f":"Calculator!I786","v":""},{"$f":"Calculator!J786","v":""}]
[{"$f":"IFERROR(YEAR(Calculator!C787),\"\")","v":""},{"$f":"IFERROR(VLOOKUP(MONTH(Calculator!C787),'Month mapping'!A:B,2,0),\"\")","v":""},{"$f":"Calculator!D787","v":""},{"$f":"Calculator!E787","v":""},{"$f":"Calculator!G787","v":""},{"$f":"Calculator!H787","v":""},{"$f":"Calculator!I787","v":""},{"$f":"Calculator!J787","v":""}]
[{"$f":"IFERROR(YEAR(Calculator!C788),\"\")","v":""},{"$f":"IFERROR(VLOOKUP(MONTH(Calculator!C788),'Month mapping'!A:B,2,0),\"\")","v":""},{"$f":"Calculator!D788","v":""},{"$f":"Calculator!E788","v":""},{"$f":"Calculator!G788","v":""},{"$f":"Calculator!H788","v":""},{"$f":"Calculator!I788","v":""},{"$f":"Calculator!J788","v":""}]
[{"$f":"IFERROR(YEAR(Calculator!C789),\"\")","v":""},{"$f":"IFERROR(VLOOKUP(MONTH(Calculator!C789),'Month mapping'!A:B,2,0),\"\")","v":""},{"$f":"Calculator!D789","v":""},{"$f":"Calculator!E789","v":""},{"$f":"Calculator!G789","v":""},{"$f":"Calculator!H789","v":""},{"$f":"Calculator!I789","v":""},{"$f":"Calculator!J789","v":""}]
[{"$f":"IFERROR(YEAR(Calculator!C790),\"\")","v":""},{"$f":"IFERROR(VLOOKUP(MONTH(Calculator!C790),'Month mapping'!A:B,2,0),\"\")","v":""},{"$f":"Calculator!D790","v":""},{"$f":"Calculator!E790","v":""},{"$f":"Calculator!G790","v":""},{"$f":"Calculator!H790","v":""},{"$f":"Calculator!I790","v":""},{"$f":"Calculator!J790","v":""}]
[{"$f":"IFERROR(YEAR(Calculator!C791),\"\")","v":""},{"$f":"IFERROR(VLOOKUP(MONTH(Calculator!C791),'Month mapping'!A:B,2,0),\"\")","v":""},{"$f":"Calculator!D791","v":""},{"$f":"Calculator!E791","v":""},{"$f":"Calculator!G791","v":""},{"$f":"Calculator!H791","v":""},{"$f":"Calculator!I791","v":""},{"$f":"Calculator!J791","v":""}]
[{"$f":"IFERROR(YEAR(Calculator!C792),\"\")","v":""},{"$f":"IFERROR(VLOOKUP(MONTH(Calculator!C792),'Month mapping'!A:B,2,0),\"\")","v":""},{"$f":"Calculator!D792","v":""},{"$f":"Calculator!E792","v":""},{"$f":"Calculator!G792","v":""},{"$f":"Calculator!H792","v":""},{"$f":"Calculator!I792","v":""},{"$f":"Calculator!J792","v":""}]
[{"$f":"IFERROR(YEAR(Calculator!C793),\"\")","v":""},{"$f":"IFERROR(VLOOKUP(MONTH(Calculator!C793),'Month mapping'!A:B,2,0),\"\")","v":""},{"$f":"Calculator!D793","v":""},{"$f":"Calculator!E793","v":""},{"$f":"Calculator!G793","v":""},{"$f":"Calculator!H793","v":""},{"$f":"Calculator!I793","v":""},{"$f":"Calculator!J793","v":""}]
[{"$f":"IFERROR(YEAR(Calculator!C794),\"\")","v":""},{"$f":"IFERROR(VLOOKUP(MONTH(Calculator!C794),'Month mapping'!A:B,2,0),\"\")","v":""},{"$f":"Calculator!D794","v":""},{"$f":"Calculator!E794","v":""},{"$f":"Calculator!G794","v":""},{"$f":"Calculator!H794","v":""},{"$f":"Calculator!I794","v":""},{"$f":"Calculator!J794","v":""}]
[{"$f":"IFERROR(YEAR(Calculator!C795),\"\")","v":""},{"$f":"IFERROR(VLOOKUP(MONTH(Calculator!C795),'Month mapping'!A:B,2,0),\"\")","v":""},{"$f":"Calculator!D795","v":""},{"$f":"Calculator!E795","v":""},{"$f":"Calculator!G795","v":""},{"$f":"Calculator!H795","v":""},{"$f":"Calculator!I795","v":""},{"$f":"Calculator!J795","v":""}]
[{"$f":"IFERROR(YEAR(Calculator!C796),\"\")","v":""},{"$f":"IFERROR(VLOOKUP(MONTH(Calculator!C796),'Month mapping'!A:B,2,0),\"\")","v":""},{"$f":"Calculator!D796","v":""},{"$f":"Calculator!E796","v":""},{"$f":"Calculator!G796","v":""},{"$f":"Calculator!H796","v":""},{"$f":"Calculator!I796","v":""},{"$f":"Calculator!J796","v":""}]
[{"$f":"IFERROR(YEAR(Calculator!C797),\"\")","v":""},{"$f":"IFERROR(VLOOKUP(MONTH(Calculator!C797),'Month mapping'!A:B,2,0),\"\")","v":""},{"$f":"Calculator!D797","v":""},{"$f":"Calculator!E797","v":""},{"$f":"Calculator!G797","v":""},{"$f":"Calculator!H797","v":""},{"$f":"Calculator!I797","v":""},{"$f":"Calculator!J797","v":""}]
[{"$f":"IFERROR(YEAR(Calculator!C798),\"\")","v":""},{"$f":"IFERROR(VLOOKUP(MONTH(Calculator!C798),'Month mapping'!A:B,2,0),\"\")","v":""},{"$f":"Calculator!D798","v":""},{"$f":"Calculator!E798","v":""},{"$f":"Calculator!G798","v":""},{"$f":"Calculator!H798","v":""},{"$f":"Calculator!I798","v":""},{"$f":"Calculator!J798","v":""}]
[{"$f":"IFERROR(YEAR(Calculator!C799),\"\")","v":""},{"$f":"IFERROR(VLOOKUP(MONTH(Calculator!C799),'Month mapping'!A:B,2,0),\"\")","v":""},{"$f":"Calculator!D799","v":""},{"$f":"Calculator!E799","v":""},{"$f":"Calculator!G799","v":""},{"$f":"Calculator!H799","v":""},{"$f":"Calculator!I799","v":""},{"$f":"Calculator!J799","v":""}]
[{"$f":"IFERROR(YEAR(Calculator!C800),\"\")","v":""},{"$f":"IFERROR(VLOOKUP(MONTH(Calculator!C800),'Month mapping'!A:B,2,0),\"\")","v":""},{"$f":"Calculator!D800","v":""},{"$f":"Calculator!E800","v":""},{"$f":"Calculator!G800","v":""},{"$f":"Calculator!H800","v":""},{"$f":"Calculator!I800","v":""},{"$f":"Calculator!J800","v":""}]
[{"$f":"IFERROR(YEAR(Calculator!C801),\"\")","v":""},{"$f":"IFERROR(VLOOKUP(MONTH(Calculator!C801),'Month mapping'!A:B,2,0),\"\")","v":""},{"$f":"Calculator!D801","v":""},{"$f":"Calculator!E801","v":""},{"$f":"Calculator!G801","v":""},{"$f":"Calculator!H801","v":""},{"$f":"Calculator!I801","v":""},{"$f":"Calculator!J801","v":""}]
[{"$f":"IFERROR(YEAR(Calculator!C802),\"\")","v":""},{"$f":"IFERROR(VLOOKUP(MONTH(Calculator!C802),'Month mapping'!A:B,2,0),\"\")","v":""},{"$f":"Calculator!D802","v":""},{"$f":"Calculator!E802","v":""},{"$f":"Calculator!G802","v":""},{"$f":"Calculator!H802","v":""},{"$f":"Calculator!I802","v":""},{"$f":"Calculator!J802","v":""}]
[{"$f":"IFERROR(YEAR(Calculator!C803),\"\")","v":""},{"$f":"IFERROR(VLOOKUP(MONTH(Calculator!C803),'Month mapping'!A:B,2,0),\"\")","v":""},{"$f":"Calculator!D803","v":""},{"$f":"Calculator!E803","v":""},{"$f":"Calculator!G803","v":""},{"$f":"Calculator!H803","v":""},{"$f":"Calculator!I803","v":""},{"$f":"Calculator!J803","v":""}]
[{"$f":"IFERROR(YEAR(Calculator!C804),\"\")","v":""},{"$f":"IFERROR(VLOOKUP(MONTH(Calculator!C804),'Month mapping'!A:B,2,0),\"\")","v":""},{"$f":"Calculator!D804","v":""},{"$f":"Calculator!E804","v":""},{"$f":"Calculator!G804","v":""},{"$f":"Calculator!H804","v":""},{"$f":"Calculator!I804","v":""},{"$f":"Calculator!J804","v":""}]
[{"$f":"IFERROR(YEAR(Calculator!C805),\"\")","v":""},{"$f":"IFERROR(VLOOKUP(MONTH(Calculator!C805),'Month mapping'!A:B,2,0),\"\")","v":""},{"$f":"Calculator!D805","v":""},{"$f":"Calculator!E805","v":""},{"$f":"Calculator!G805","v":""},{"$f":"Calculator!H805","v":""},{"$f":"Calculator!I805","v":""},{"$f":"Calculator!J805","v":""}]
[{"$f":"IFERROR(YEAR(Calculator!C806),\"\")","v":""},{"$f":"IFERROR(VLOOKUP(MONTH(Calculator!C806),'Month mapping'!A:B,2,0),\"\")","v":""},{"$f":"Calculator!D806","v":""},{"$f":"Calculator!E806","v":""},{"$f":"Calculator!G806","v":""},{"$f":"Calculator!H806","v":""},{"$f":"Calculator!I806","v":""},{"$f":"Calculator!J806","v":""}]
[{"$f":"IFERROR(YEAR(Calculator!C807),\"\")","v":""},{"$f":"IFERROR(VLOOKUP(MONTH(Calculator!C807),'Month mapping'!A:B,2,0),\"\")","v":""},{"$f":"Calculator!D807","v":""},{"$f":"Calculator!E807","v":""},{"$f":"Calculator!G807","v":""},{"$f":"Calculator!H807","v":""},{"$f":"Calculator!I807","v":""},{"$f":"Calculator!J807","v":""}]
[{"$f":"IFERROR(YEAR(Calculator!C808),\"\")","v":""},{"$f":"IFERROR(VLOOKUP(MONTH(Calculator!C808),'Month mapping'!A:B,2,0),\"\")","v":""},{"$f":"Calculator!D808","v":""},{"$f":"Calculator!E808","v":""},{"$f":"Calculator!G808","v":""},{"$f":"Calculator!H808","v":""},{"$f":"Calculator!I808","v":""},{"$f":"Calculator!J808","v":""}]
[{"$f":"IFERROR(YEAR(Calculator!C809),\"\")","v":""},{"$f":"IFERROR(VLOOKUP(MONTH(Calculator!C809),'Month mapping'!A:B,2,0),\"\")","v":""},{"$f":"Calculator!D809","v":""},{"$f":"Calculator!E809","v":""},{"$f":"Calculator!G809","v":""},{"$f":"Calculator!H809","v":""},{"$f":"Calculator!I809","v":""},{"$f":"Calculator!J809","v":""}]
[{"$f":"IFERROR(YEAR(Calculator!C810),\"\")","v":""},{"$f":"IFERROR(VLOOKUP(MONTH(Calculator!C810),'Month mapping'!A:B,2,0),\"\")","v":""},{"$f":"Calculator!D810","v":""},{"$f":"Calculator!E810","v":""},{"$f":"Calculator!G810","v":""},{"$f":"Calculator!H810","v":""},{"$f":"Calculator!I810","v":""},{"$f":"Calculator!J810","v":""}]
[{"$f":"IFERROR(YEAR(Calculator!C811),\"\")","v":""},{"$f":"IFERROR(VLOOKUP(MONTH(Calculator!C811),'Month mapping'!A:B,2,0),\"\")","v":""},{"$f":"Calculator!D811","v":""},{"$f":"Calculator!E811","v":""},{"$f":"Calculator!G811","v":""},{"$f":"Calculator!H811","v":""},{"$f":"Calculator!I811","v":""},{"$f":"Calculator!J811","v":""}]
[{"$f":"IFERROR(YEAR(Calculator!C812),\"\")","v":""},{"$f":"IFERROR(VLOOKUP(MONTH(Calculator!C812),'Month mapping'!A:B,2,0),\"\")","v":""},{"$f":"Calculator!D812","v":""},{"$f":"Calculator!E812","v":""},{"$f":"Calculator!G812","v":""},{"$f":"Calculator!H812","v":""},{"$f":"Calculator!I812","v":""},{"$f":"Calculator!J812","v":""}]
[{"$f":"IFERROR(YEAR(Calculator!C813),\"\")","v":""},{"$f":"IFERROR(VLOOKUP(MONTH(Calculator!C813),'Month mapping'!A:B,2,0),\"\")","v":""},{"$f":"Calculator!D813","v":""},{"$f":"Calculator!E813","v":""},{"$f":"Calculator!G813","v":""},{"$f":"Calculator!H813","v":""},{"$f":"Calculator!I813","v":""},{"$f":"Calculator!J813","v":""}]
[{"$f":"IFERROR(YEAR(Calculator!C814),\"\")","v":""},{"$f":"IFERROR(VLOOKUP(MONTH(Calculator!C814),'Month mapping'!A:B,2,0),\"\")","v":""},{"$f":"Calculator!D814","v":""},{"$f":"Calculator!E814","v":""},{"$f":"Calculator!G814","v":""},{"$f":"Calculator!H814","v":""},{"$f":"Calculator!I814","v":""},{"$f":"Calculator!J814","v":""}]
[{"$f":"IFERROR(YEAR(Calculator!C815),\"\")","v":""},{"$f":"IFERROR(VLOOKUP(MONTH(Calculator!C815),'Month mapping'!A:B,2,0),\"\")","v":""},{"$f":"Calculator!D815","v":""},{"$f":"Calculator!E815","v":""},{"$f":"Calculator!G815","v":""},{"$f":"Calculator!H815","v":""},{"$f":"Calculator!I815","v":""},{"$f":"Calculator!J815","v":""}]
[{"$f":"IFERROR(YEAR(Calculator!C816),\"\")","v":""},{"$f":"IFERROR(VLOOKUP(MONTH(Calculator!C816),'Month mapping'!A:B,2,0),\"\")","v":""},{"$f":"Calculator!D816","v":""},{"$f":"Calculator!E816","v":""},{"$f":"Calculator!G816","v":""},{"$f":"Calculator!H816","v":""},{"$f":"Calculator!I816","v":""},{"$f":"Calculator!J816","v":""}]
[{"$f":"IFERROR(YEAR(Calculator!C817),\"\")","v":""},{"$f":"IFERROR(VLOOKUP(MONTH(Calculator!C817),'Month mapping'!A:B,2,0),\"\")","v":""},{"$f":"Calculator!D817","v":""},{"$f":"Calculator!E817","v":""},{"$f":"Calculator!G817","v":""},{"$f":"Calculator!H817","v":""},{"$f":"Calculator!I817","v":""},{"$f":"Calculator!J817","v":""}]
[{"$f":"IFERROR(YEAR(Calculator!C818),\"\")","v":""},{"$f":"IFERROR(VLOOKUP(MONTH(Calculator!C818),'Month mapping'!A:B,2,0),\"\")","v":""},{"$f":"Calculator!D818","v":""},{"$f":"Calculator!E818","v":""},{"$f":"Calculator!G818","v":""},{"$f":"Calculator!H818","v":""},{"$f":"Calculator!I818","v":""},{"$f":"Calculator!J818","v":""}]
[{"$f":"IFERROR(YEAR(Calculator!C819),\"\")","v":""},{"$f":"IFERROR(VLOOKUP(MONTH(Calculator!C819),'Month mapping'!A:B,2,0),\"\")","v":""},{"$f":"Calculator!D819","v":""},{"$f":"Calculator!E819","v":""},{"$f":"Calculator!G819","v":""},{"$f":"Calculator!H819","v":""},{"$f":"Calculator!I819","v":""},{"$f":"Calculator!J819","v":""}]
[{"$f":"IFERROR(YEAR(Calculator!C820),\"\")","v":""},{"$f":"IFERROR(VLOOKUP(MONTH(Calculator!C820),'Month mapping'!A:B,2,0),\"\")","v":""},{"$f":"Calculator!D820","v":""},{"$f":"Calculator!E820","v":""},{"$f":"Calculator!G820","v":""},{"$f":"Calculator!H820","v":""},{"$f":"Calculator!I820","v":""},{"$f":"Calculator!J820","v":""}]
[{"$f":"IFERROR(YEAR(Calculator!C821),\"\")","v":""},{"$f":"IFERROR(VLOOKUP(MONTH(Calculator!C821),'Month mapping'!A:B,2,0),\"\")","v":""},{"$f":"Calculator!D821","v":""},{"$f":"Calculator!E821","v":""},{"$f":"Calculator!G821","v":""},{"$f":"Calculator!H821","v":""},{"$f":"Calculator!I821","v":""},{"$f":"Calculator!J821","v":""}]
[{"$f":"IFERROR(YEAR(Calculator!C822),\"\")","v":""},{"$f":"IFERROR(VLOOKUP(MONTH(Calculator!C822),'Month mapping'!A:B,2,0),\"\")","v":""},{"$f":"Calculator!D822","v":""},{"$f":"Calculator!E822","v":""},{"$f":"Calculator!G822","v":""},{"$f":"Calculator!H822","v":""},{"$f":"Calculator!I822","v":""},{"$f":"Calculator!J822","v":""}]
[{"$f":"IFERROR(YEAR(Calculator!C823),\"\")","v":""},{"$f":"IFERROR(VLOOKUP(MONTH(Calculator!C823),'Month mapping'!A:B,2,0),\"\")","v":""},{"$f":"Calculator!D823","v":""},{"$f":"Calculator!E823","v":""},{"$f":"Calculator!G823","v":""},{"$f":"Calculator!H823","v":""},{"$f":"Calculator!I823","v":""},{"$f":"Calculator!J823","v":""}]
[{"$f":"IFERROR(YEAR(Calculator!C824),\"\")","v":""},{"$f":"IFERROR(VLOOKUP(MONTH(Calculator!C824),'Month mapping'!A:B,2,0),\"\")","v":""},{"$f":"Calculator!D824","v":""},{"$f":"Calculator!E824","v":""},{"$f":"Calculator!G824","v":""},{"$f":"Calculator!H824","v":""},{"$f":"Calculator!I824","v":""},{"$f":"Calculator!J824","v":""}]
[{"$f":"IFERROR(YEAR(Calculator!C825),\"\")","v":""},{"$f":"IFERROR(VLOOKUP(MONTH(Calculator!C825),'Month mapping'!A:B,2,0),\"\")","v":""},{"$f":"Calculator!D825","v":""},{"$f":"Calculator!E825","v":""},{"$f":"Calculator!G825","v":""},{"$f":"Calculator!H825","v":""},{"$f":"Calculator!I825","v":""},{"$f":"Calculator!J825","v":""}]
[{"$f":"IFERROR(YEAR(Calculator!C826),\"\")","v":""},{"$f":"IFERROR(VLOOKUP(MONTH(Calculator!C826),'Month mapping'!A:B,2,0),\"\")","v":""},{"$f":"Calculator!D826","v":""},{"$f":"Calculator!E826","v":""},{"$f":"Calculator!G826","v":""},{"$f":"Calculator!H826","v":""},{"$f":"Calculator!I826","v":""},{"$f":"Calculator!J826","v":""}]
[{"$f":"IFERROR(YEAR(Calculator!C827),\"\")","v":""},{"$f":"IFERROR(VLOOKUP(MONTH(Calculator!C827),'Month mapping'!A:B,2,0),\"\")","v":""},{"$f":"Calculator!D827","v":""},{"$f":"Calculator!E827","v":""},{"$f":"Calculator!G827","v":""},{"$f":"Calculator!H827","v":""},{"$f":"Calculator!I827","v":""},{"$f":"Calculator!J827","v":""}]

{"sheet":"Calculator","index":1,"n_rows":1000,"n_cols":11,"rows_kept":1000,"cut":false,"hidden":false,"merged":[[0,2,0,6]]}
[null,null,{"$f":"INDIRECT(\"'Dictionary'!R\"&MATCH(\"Mortgage calculator\",Dictionary!A:A,0)&\"C\"&LangCol,FALSE)","v":"Tabla de amortización"}]
[null,{"$f":"IF(AND(mois<>\"\",annee<>\"\",annee>0,pret<>\"\",pret>0,dureepret<>\"\",dureepret>0,tauxinteret<>\"\",tauxinteret>0),\"OK\",\"NOK\")","v":"OK"},{"$f":"INDIRECT(\"'Dictionary'!R\"&MATCH(\"Mortgage data\",Dictionary!A:A,0)&\"C\"&LangCol,FALSE)","v":"Datos de prestamo"}]
[]
[null,null,null,{"$f":"INDIRECT(\"'Dictionary'!R\"&MATCH(\"Start date\",Dictionary!A:A,0)&\"C\"&LangCol,FALSE)","v":"Fecha de inicio"},"agosto",2020,null,null,"Language:","Espanol",{"$f":"MATCH(J4,Dictionary!1:1,0)","v":6}]
[null,null,null,null,{"$f":"INDEX(Dictionary!A:A,MATCH(Calculator!mois,INDIRECT(\"Dictionary!R1C\"&LangCol&\":R100C\"&LangCol,FALSE),0))","v":"August"}]
[null,null,null,{"$f":"INDIRECT(\"'Dictionary'!R\"&MATCH(\"Mortgage amount\",Dictionary!A:A,0)&\"C\"&LangCol,FALSE)","v":"Importe del préstamo"},200000,{"$f":"INDIRECT(\"'Dictionary'!R\"&MATCH(\"£\",Dictionary!A:A,0)&\"C\"&LangCol,FALSE)","v":"€"}]
[]
[null,null,null,{"$f":"INDIRECT(\"'Dictionary'!R\"&MATCH(\"Mortgage term\",Dictionary!A:A,0)&\"C\"&LangCol,FALSE)","v":"Duración"},36,{"$f":"INDIRECT(\"'Dictionary'!R\"&MATCH(\"months\",Dictionary!A:A,0)&\"C\"&LangCol,FALSE)","v":"mes"}]
[]
[null,null,null,{"$f":"INDIRECT(\"'Dictionary'!R\"&MATCH(\"Interest rate per year\",Dictionary!A:A,0)&\"C\"&LangCol,FALSE)","v":"Tasa de interés"},2," %"]
[]
[null,null,null,{"$f":"INDIRECT(\"'Dictionary'!R\"&MATCH(\"Insurance rate\",Dictionary!A:A,0)&\"C\"&LangCol,FALSE)","v":"Tasa de seguro"},1,{"$f":"INDIRECT(\"'Dictionary'!R\"&MATCH(\"% of borrowed amount\",Dictionary!A:A,0)&\"C\"&LangCol,FALSE)","v":"% de la cantidad prestada"}]
[]
[null,{"$f":"IF(AND(OR(typediffere=3,typediffere=2),dureediffere>0,dureediffere<dureepret),\"OK\",IF(AND(typediffere=1,dureediffere>=0),\"OK\",\"NOK\"))","v":"OK"},{"$f":"INDIRECT(\"'Dictionary'!R\"&MATCH(\"Deferred repayment\",Dictionary!A:A,0)&\"C\"&LangCol,FALSE)","v":"Pago diferido"}]
[]
[null,null,null,null,{"$f":"INDIRECT(\"'Dictionary'!R\"&MATCH(\"Without delay\",Dictionary!A:A,0)&\"C\"&LangCol,FALSE)","v":"Sin"}]
[null,1,null,{"$f":"INDIRECT(\"'Dictionary'!R\"&MATCH(\"Type\",Dictionary!A:A,0)&\"C\"&LangCol,FALSE)","v":"Tipo diferido"},{"$f":"INDIRECT(\"'Dictionary'!R\"&MATCH(\"Partial (with interest payment)\",Dictionary!A:A,0)&\"C\"&LangCol,FALSE)","v":"Parcial (con pago de intereses)"}]
[null,null,null,null,{"$f":"INDIRECT(\"'Dictionary'!R\"&MATCH(\"Total (without interest payment)\",Dictionary!A:A,0)&\"C\"&LangCol,FALSE)","v":"Total (sin pago de intereses)"}]
[]
[null,null,null,{"$f":"INDIRECT(\"'Dictionary'!R\"&MATCH(\"Duration\",Dictionary!A:A,0)&\"C\"&LangCol,FALSE)","v":"Duración del diferido"},null,{"$f":"INDIRECT(\"'Dictionary'!R\"&MATCH(\"months\",Dictionary!A:A,0)&\"C\"&LangCol,FALSE)","v":"mes"}]
[]
[null,null,{"$f":"INDIRECT(\"'Dictionary'!R\"&MATCH(\"Mortgage cost\",Dictionary!A:A,0)&\"C\"&LangCol,FALSE)","v":"Costo total del préstamo"}]
[]
[null,null,null,{"$f":"INDIRECT(\"'Dictionary'!R\"&MATCH(\"Total Interest\",Dictionary!A:A,0)&\"C\"&LangCol,FALSE)","v":"Costo de interés"},{"$f":"IF(AND(test=\"OK\",test2=\"OK\"),SUM(G30:G1000),0)","v":6226.5668736861753},{"$f":"INDIRECT(\"'Dictionary'!R\"&MATCH(\"£\",Dictionary!A:A,0)&\"C\"&LangCol,FALSE)","v":"€"}]
[null,null,null,{"$f":"INDIRECT(\"'Dictionary'!R\"&MATCH(\"Total insurance\",Dictionary!A:A,0)&\"C\"&LangCol,FALSE)","v":"Costo del seguro"},{"$f":"IF(AND(test=\"OK\",test2=\"OK\"),pret*tauxassurance*0.01*dureepret/12,0)","v":6000},{"$f":"INDIRECT(\"'Dictionary'!R\"&MATCH(\"£\",Dictionary!A:A,0)&\"C\"&LangCol,FALSE)","v":"€"}]
[null,null,null,{"$f":"INDIRECT(\"'Dictionary'!R\"&MATCH(\"Total cost\",Dictionary!A:A,0)&\"C\"&LangCol,FALSE)","v":"Costo total del préstamo"},{"$f":"IF(AND(test=\"OK\",test2=\"OK\"),E24+E25,0)","v":12226.566873686175},{"$f":"INDIRECT(\"'Dictionary'!R\"&MATCH(\"£\",Dictionary!A:A,0)&\"C\"&LangCol,FALSE)","v":"€"}]
[]
[null,null,{"$f":"INDIRECT(\"'Dictionary'!R\"&MATCH(\"Amortization schedule calculator\",Dictionary!A:A,0)&\"C\"&LangCol,FALSE)","v":"Tabla de amortización"}]
[null,0,{"$f":"INDIRECT(\"'Dictionary'!R\"&MATCH(\"Date\",Dictionary!A:A,0)&\"C\"&LangCol,FALSE)","v":"Fecha"},{"$f":"INDIRECT(\"'Dictionary'!R\"&MATCH(\"No.\",Dictionary!A:A,0)&\"C\"&LangCol,FALSE)","v":"Cantidad de pagos"},{"$f":"INDIRECT(\"'Dictionary'!R\"&MATCH(\"Monthly payment with insurance\",Dictionary!A:A,0)&\"C\"&LangCol,FALSE)","v":"Pago mensual con seguro"},{"$f":"INDIRECT(\"'Dictionary'!R\"&MATCH(\"Monthly payment without insurance\",Dictionary!A:A,0)&\"C\"&LangCol,FALSE)","v":"Pago mensual sin seguro"},{"$f":"INDIRECT(\"'Dictionary'!R\"&MATCH(\"Interest\",Dictionary!A:A,0)&\"C\"&LangCol,FALSE)","v":"Intereses"},{"$f":"INDIRECT(\"'Dictionary'!R\"&MATCH(\"Insurance\",Dictionary!A:A,0)&\"C\"&LangCol,FALSE)","v":"Seguro"},{"$f":"INDIRECT(\"'Dictionary'!R\"&MATCH(\"Principal\",Dictionary!A:A,0)&\"C\"&LangCol,FALSE)","v":"Capital pagado"},{"$f":"INDIRECT(\"'Dictionary'!R\"&MATCH(\"Balance\",Dictionary!A:A,0)&\"C\"&LangCol,FALSE)","v":"Capital restante"},{"$f":"INDIRECT(\"'Dictionary'!R\"&MATCH(\"Total Interest\t\",Dictionary!A:A,0)&\"C\"&LangCol,FALSE)","v":"Interés acumulado"}]
[null,{"$f":"IF(AND(D30<>\"\",OR(typediffere=2,typediffere=3),B29<dureediffere),\"D\",D30)","v":1},{"$f":"IF(D30<>\"\",DATE(F4,COUNTIF(monthEnglish,\"January\")*1+COUNTIF(monthEnglish,\"February\")*2+COUNTIF(monthEnglish,\"March\")*3+COUNTIF(monthEnglish,\"April\")*4+COUNTIF(monthEnglish,\"May\")*5+COUNTIF(monthEnglish,\"June\")*6+COUNTIF(monthEnglish,\"July\")*7+COUNTIF(monthEnglish,\"August\")*8+COUNTIF(monthEnglish,\"September\")*9+COUNTIF(monthEnglish,\"October\")*10+COUNTIF(monthEnglish,\"November\")*11+COUNTIF(monthEnglish,\"December\")*12,1),\"\")","v":"2020-08-01"},{"$f":"IF(AND(test=\"OK\",test2=\"OK\"),1,\"\")","v":1},{"$f":"IF(D30<>\"\",F30+H30,\"\")","v":5895.1824131577205},{"$f":"IF(AND(D30<>\"\",B30=D30,typediffere=1),(pret*tauxinteret/100)/(12*(1-POWER(1+((tauxinteret/100)/12),-dureepret))),IF(AND(D30<>\"\",B30=D30,typediffere=2),(pret*tauxinteret/100)/(12*(1-POWER(1+((tauxinteret/100)/12),-dureepret+dureediffere))),IF(AND(D30<>\"\",B30=\"D\",typediffere=2),G30,IF(AND(D30<>\"\",B30=\"D\",typediffere=3),0,IF(AND(D30<>\"\",B30=D30,B29=\"D\",typediffere=3),(pret*tauxinteret/100)/(12*(1-POWER(1+((tauxinteret/100)/12),-dureepret+dureediffere))),IF(AND(D30<>\"\",B30=D30,B29<>\"D\",typediffere=3),0,\"\"))))))","v":5728.5157464910535},{"$f":"IF(D30<>\"\",pret*tauxinteret/100/12,\"\")","v":333.33333333333331},{"$f":"IF(D30<>\"\",pret*tauxassurance/100/12,\"\")","v":166.66666666666666},{"$f":"IF(AND(D30<>\"\",B30=D30),F30-G30,IF(AND(D30<>\"\",B30=\"D\"),0,\"\"))","v":5395.1824131577205},{"$f":"IF(OR(AND(D30<>\"\",B30=D30),AND(D30<>\"\",B30=\"D\",typediffere=2)),pret-F30+G30,IF(AND(D30<>\"\",B30=\"D\",typediffere=3),pret+G30,\"\"))","v":194604.81758684228},{"$f":"IF(D30<>\"\",G30,\"\")","v":333.33333333333331}]
[null,{"$f":"IF(AND(D31<>\"\",OR(typediffere=2,typediffere=3),D30<dureediffere),\"D\",D31)","v":2},{"$f":"IF(D31<>\"\",DATE(YEAR(C30),MONTH(C30)+1,DAY(C30)),\"\")","v":"2020-09-01"},{"$f":"IF(AND(D30>0,D30<dureepret),D30+1,\"\")","v":2},5895.1824131577205,{"$f":"IF(AND(D31<>\"\",B31=D31,typediffere=1),(pret*tauxinteret/100)/(12*(1-POWER(1+((tauxinteret/100)/12),-dureepret))),IF(AND(D31<>\"\",B31=D31,typediffere=2),(pret*tauxinteret/100)/(12*(1-POWER(1+((tauxinteret/100)/12),-dureepret+dureediffere))),IF(AND(D31<>\"\",B31=\"D\",typediffere=2),G31,IF(AND(D31<>\"\",B31=\"D\",typediffere=3),0,IF(AND(D31<>\"\",B31=D31,B30=\"D\",typediffere=3),(J30*tauxinteret/100)/(12*(1-POWER(1+((tauxinteret/100)/12),-dureepret+dureediffere))),IF(AND(D31<>\"\",B31=D31,B30<>\"D\",typediffere=3),F30,\"\"))))))","v":5728.5157464910535},{"$f":"IF(D31<>\"\",J30*tauxinteret/100/12,\"\")","v":324.3413626447371},166.66666666666666,{"$f":"IF(AND(D31<>\"\",B31=D31),F31-G31,IF(AND(D31<>\"\",B31=\"D\"),0,\"\"))","v":5404.1743838463162},{"$f":"IF(OR(AND(D31<>\"\",B31=D31),AND(D31<>\"\",B31=\"D\",typediffere=2)),J30-F31+G31,IF(AND(D31<>\"\",B31=\"D\",typediffere=3),J30+G31,\"\"))","v":189200.64320299597},{"$f":"IF(D31<>\"\",K30+G31,\"\")","v":657.67469597807042}]
[null,3,"2020-10-01",3,5895.1824131577205,5728.5157464910535,315.33440533832663,166.66666666666666,5413.1813411527273,183787.46186184324,973.00910131639705]
[null,4,"2020-11-01",4,5895.1824131577205,5728.5157464910535,306.31243643640539,166.66666666666666,5422.2033100546478,178365.2585517886,1279.3215377528024]
[null,5,"2020-12-01",5,5895.1824131577205,5728.5157464910535,297.2754309196477,166.66666666666666,5431.2403155714055,172934.01823621721,1576.5969686724502]
[null,6,"2021-01-01",6,5895.1824131577205,5728.5157464910535,288.2233637270287,166.66666666666666,5440.2923827640252,167493.72585345319,1864.820332399479]
[null,7,"2021-02-01",7,5895.1824131577205,5728.5157464910535,279.1562097557553,166.66666666666666,5449.3595367352982,162044.36631671787,2143.9765421552343]
[null,8,"2021-03-01",8,5895.1824131577205,5728.5157464910535,270.07394386119648,166.66666666666666,5458.4418026298572,156585.92451408802,2414.0504860164306]
[null,9,"2021-04-01",9,5895.1824131577205,5728.5157464910535,260.97654085681336,166.66666666666666,5467.5392056342398,151118.38530845378,2675.0270268732438]
[null,10,"2021-05-01",10,5895.1824131577205,5728.5157464910535,251.86397551408962,166.66666666666666,5476.6517709769641,145641.7335374768,2926.8910023873336]
[null,11,"2021-06-01",11,5895.1824131577205,5728.5157464910535,242.73622256246134,166.66666666666666,5485.7795239285924,140155.95401354821,3169.6272249497952]
[null,12,"2021-07-01",12,5895.1824131577205,5728.5157464910535,233.59325668924703,166.66666666666666,5494.9224898018065,134661.03152374641,3403.2204816390422]
[null,13,"2021-08-01",13,5895.1824131577205,5728.5157464910535,224.43505253957736,166.66666666666666,5504.080693951476,129156.95082979492,3627.6555341786197]
[null,14,"2021-09-01",14,5895.1824131577205,5728.5157464910535,215.26158471632485,166.66666666666666,5513.2541617747283,123643.69666802019,3842.9171188949445]
[null,15,"2021-10-01",15,5895.1824131577205,5728.5157464910535,206.07282778003366,166.66666666666666,5522.44291871102,118121.25374930917,4048.989946674978]
[null,16,"2021-11-01",16,5895.1824131577205,5728.5157464910535,196.86875624884863,166.66666666666666,5531.646990242205,112589.60675906696,4245.858702923827]
[null,17,"2021-12-01",17,5895.1824131577205,5728.5157464910535,187.64934459844494,166.66666666666666,5540.8664018926083,107048.74035717433,4433.5080475222721]
[null,18,"2022-01-01",18,5895.1824131577205,5728.5157464910535,178.41456726195722,166.66666666666666,5550.1011792290965,101498.63917794524,4611.9226147842292]
[null,19,"2022-02-01",19,5895.1824131577205,5728.5157464910535,169.16439862990873,166.66666666666666,5559.3513478611449,95939.287830084082,4781.0870134141378]
[null,20,"2022-03-01",20,5895.1824131577205,5728.5157464910535,159.89881305014015,166.66666666666666,5568.6169334409133,90370.670896643162,4940.985826464278]
[null,21,"2022-04-01",21,5895.1824131577205,5728.5157464910535,150.6177848277386,166.66666666666666,5577.8979616633151,84792.772934979846,5091.6036112920165]
[null,22,"2022-05-01",22,5895.1824131577205,5728.5157464910535,141.32128822496642,166.66666666666666,5587.1944582660872,79205.578476713752,5232.9248995169828]
[null,23,"2022-06-01",23,5895.1824131577205,5728.5157464910535,132.00929746118959,166.66666666666666,5596.5064490298637,73609.072027683884,5364.9341969781726]
[null,24,"2022-07-01",24,5895.1824131577205,5728.5157464910535,122.68178671280647,166.66666666666666,5605.8339597782469,68003.238067905637,5487.6159836909792]
[null,25,"2022-08-01",25,5895.1824131577205,5728.5157464910535,113.33873011317606,166.66666666666666,5615.1770163778774,62388.061051527759,5600.9547138041553]
[null,26,"2022-09-01",26,5895.1824131577205,5728.5157464910535,103.98010175254626,166.66666666666666,5624.5356447385075,56763.525406789253,5704.9348155567013]
[null,27,"2022-10-01",27,5895.1824131577205,5728.5157464910535,94.605875677982098,166.66666666666666,5633.9098708130714,51129.615535976183,5799.5406912346834]
[null,28,"2022-11-01",28,5895.1824131577205,5728.5157464910535,85.216025893293633,166.66666666666666,5643.2997205977599,45486.315815378424,5884.756717127977]
[null,29,"2022-12-01",29,5895.1824131577205,5728.5157464910535,75.81052635896404,166.66666666666666,5652.7052201320894,39833.610595246333,5960.5672434869412]
[null,30,"2023-01-01",30,5895.1824131577205,5728.5157464910535,66.389350992077226,166.66666666666666,5662.1263954989763,34171.484199747356,6026.9565944790183]
[null,31,"2023-02-01",31,5895.1824131577205,5728.5157464910535,56.952473666245595,166.66666666666666,5671.5632728248083,28499.92092692255,6083.9090681452635]
[null,32,"2023-03-01",32,5895.1824131577205,5728.5157464910535,47.499868211537581,166.66666666666666,5681.0158782795161,22818.905048643031,6131.408936356801]
[null,33,"2023-04-01",33,5895.1824131577205,5728.5157464910535,38.031508414405053,166.66666666666666,5690.4842380766486,17128.420810566382,6169.4404447712059]
[null,34,"2023-05-01",34,5895.1824131577205,5728.5157464910535,28.547368017610637,166.66666666666666,5699.9683784734425,11428.452432092939,6197.9878127888169]
[null,35,"2023-06-01",35,5895.1824131577205,5728.5157464910535,19.0474207201549,166.66666666666666,5709.4683257708984,5718.984106322041,6217.0352335089719]
[null,36,"2023-07-01",36,5895.1824131577205,5728.5157464910535,9.5316401772034016,166.66666666666666,5718.9841063138501,8.1909394822332615E-9,6226.5668736861753]
[null,"","","","","","","","","",""]
[null,"","","","","","","","","",""]
[null,"","","","","","","","","",""]
[null,"","","","","","","","","",""]
[null,"","","","","","","","","",""]
[null,"","","","","","","","","",""]
[null,"","","","","","","","","",""]
[null,"","","","","","","","","",""]
[null,"","","","","","","","","",""]
[null,"","","","","","","","","",""]
[null,"","","","","","","","","",""]
[null,"","","","","","","","","",""]
[null,"","","","","","","","","",""]
[null,"","","","","","","","","",""]
[null,"","","","","","","","","",""]
[null,"","","","","","","","","",""]
[null,"","","","","","","","","",""]
[null,"","","","","","","","","",""]
[null,"","","","","","","","","",""]
[null,"","","","","","","","","",""]
[null,"","","","","","","","","",""]
[null,"","","","","","","","","",""]
[null,"","","","","","","","","",""]
[null,"","","","","","","","","",""]
[null,"","","","","","","","","",""]
[null,"","","","","","","","","",""]
[null,"","","","","","","","","",""]
[null,"","","","","","","","","",""]
[null,"","","",{"$f":"IF(D94<>\"\",F94+H94,\"\")","v":""},"","",{"$f":"IF(D94<>\"\",pret*tauxassurance/100/12,\"\")","v":""},"","",""]
[null,{"$f":"IF(AND(D95<>\"\",OR(typediffere=2,typediffere=3),D94<dureediffere),\"D\",D95)","v":""},{"$f":"IF(D95<>\"\",DATE(YEAR(C94),MONTH(C94)+1,DAY(C94)),\"\")","v":""},{"$f":"IF(AND(D94>0,D94<dureepret),D94+1,\"\")","v":""},"",{"$f":"IF(AND(D95<>\"\",B95=D95,typediffere=1),(pret*tauxinteret/100)/(12*(1-POWER(1+((tauxinteret/100)/12),-dureepret))),IF(AND(D95<>\"\",B95=D95,typediffere=2),(pret*tauxinteret/100)/(12*(1-POWER(1+((tauxinteret/100)/12),-dureepret+dureediffere))),IF(AND(D95<>\"\",B95=\"D\",typediffere=2),G95,IF(AND(D95<>\"\",B95=\"D\",typediffere=3),0,IF(AND(D95<>\"\",B95=D95,B94=\"D\",typediffere=3),(J94*tauxinteret/100)/(12*(1-POWER(1+((tauxinteret/100)/12),-dureepret+dureediffere))),IF(AND(D95<>\"\",B95=D95,B94<>\"D\",typediffere=3),F94,\"\"))))))","v":""},{"$f":"IF(D95<>\"\",J94*tauxinteret/100/12,\"\")","v":""},"",{"$f":"IF(AND(D95<>\"\",B95=D95),F95-G95,IF(AND(D95<>\"\",B95=\"D\"),0,\"\"))","v":""},{"$f":"IF(OR(AND(D95<>\"\",B95=D95),AND(D95<>\"\",B95=\"D\",typediffere=2)),J94-F95+G95,IF(AND(D95<>\"\",B95=\"D\",typediffere=3),J94+G95,\"\"))","v":""},{"$f":"IF(D95<>\"\",K94+G95,\"\")","v":""}]
[null,"","","","","","","","","",""]
[null,"","","","","","","","","",""]
[null,"","","","","","","","","",""]
[null,"","","","","","","","","",""]
[null,"","","","","","","","","",""]
[null,"","","","","","","","","",""]
[null,"","","","","","","","","",""]
[null,"","","","","","","","","",""]
[null,"","","","","","","","","",""]
[null,"","","","","","","","","",""]
[null,"","","","","","","","","",""]
[null,"","","","","","","","","",""]
[null,"","","","","","","","","",""]
[null,"","","","","","","","","",""]
[null,"","","","","","","","","",""]
[null,"","","","","","","","","",""]
[null,"","","","","","","","","",""]
[null,"","","","","","","","","",""]
[null,"","","","","","","","","",""]
[null,"","","","","","","","","",""]
[null,"","","","","","","","","",""]
[null,"","","","","","","","","",""]
[null,"","","","","","","","","",""]
[null,"","","","","","","","","",""]
[null,"","","","","","","","","",""]
[null,"","","","","","","","","",""]
[null,"","","","","","","","","",""]
[null,"","","","","","","","","",""]
[null,"","","","","","","","","",""]
[null,"","","","","","","","","",""]
[null,"","","","","","","","","",""]
[null,"","","","","","","","","",""]
[null,"","","","","","","","","",""]
[null,"","","","","","","","","",""]
[null,"","","","","","","","","",""]
[null,"","","","","","","","","",""]
[null,"","","","","","","","","",""]
[null,"","","","","","","","","",""]
[null,"","","","","","","","","",""]
[null,"","","","","","","","","",""]
[null,"","","","","","","","","",""]
[null,"","","","","","","","","",""]
[null,"","","","","","","","","",""]
[null,"","","","","","","","","",""]
[null,"","","","","","","","","",""]
[null,"","","","","","","","","",""]
[null,"","","","","","","","","",""]
[null,"","","","","","","","","",""]
[null,"","","","","","","","","",""]
[null,"","","","","","","","","",""]
[null,"","","","","","","","","",""]
[null,"","","","","","","","","",""]
[null,"","","","","","","","","",""]
[null,"","","","","","","","","",""]
[null,"","","","","","","","","",""]
[null,"","","","","","","","","",""]
[null,"","","","","","","","","",""]
[null,"","","","","","","","","",""]
[null,"","","","","","","","","",""]
[null,"","","","","","","","","",""]
[null,"","","","","","","","","",""]
[null,"","","","","","","","","",""]
[null,"","","",{"$f":"IF(D158<>\"\",F158+H158,\"\")","v":""},"","",{"$f":"IF(D158<>\"\",pret*tauxassurance/100/12,\"\")","v":""},"","",""]
[null,{"$f":"IF(AND(D159<>\"\",OR(typediffere=2,typediffere=3),D158<dureediffere),\"D\",D159)","v":""},{"$f":"IF(D159<>\"\",DATE(YEAR(C158),MONTH(C158)+1,DAY(C158)),\"\")","v":""},{"$f":"IF(AND(D158>0,D158<dureepret),D158+1,\"\")","v":""},"",{"$f":"IF(AND(D159<>\"\",B159=D159,typediffere=1),(pret*tauxinteret/100)/(12*(1-POWER(1+((tauxinteret/100)/12),-dureepret))),IF(AND(D159<>\"\",B159=D159,typediffere=2),(pret*tauxinteret/100)/(12*(1-POWER(1+((tauxinteret/100)/12),-dureepret+dureediffere))),IF(AND(D159<>\"\",B159=\"D\",typediffere=2),G159,IF(AND(D159<>\"\",B159=\"D\",typediffere=3),0,IF(AND(D159<>\"\",B159=D159,B158=\"D\",typediffere=3),(J158*tauxinteret/100)/(12*(1-POWER(1+((tauxinteret/100)/12),-dureepret+dureediffere))),IF(AND(D159<>\"\",B159=D159,B158<>\"D\",typediffere=3),F158,\"\"))))))","v":""},{"$f":"IF(D159<>\"\",J158*tauxinteret/100/12,\"\")","v":""},"",{"$f":"IF(AND(D159<>\"\",B159=D159),F159-G159,IF(AND(D159<>\"\",B159=\"D\"),0,\"\"))","v":""},{"$f":"IF(OR(AND(D159<>\"\",B159=D159),AND(D159<>\"\",B159=\"D\",typediffere=2)),J158-F159+G159,IF(AND(D159<>\"\",B159=\"D\",typediffere=3),J158+G159,\"\"))","v":""},{"$f":"IF(D159<>\"\",K158+G159,\"\")","v":""}]
[null,"","","","","","","","","",""]
[null,"","","","","","","","","",""]
[null,"","","","","","","","","",""]
[null,"","","","","","","","","",""]
[null,"","","","","","","","","",""]
[null,"","","","","","","","","",""]
[null,"","","","","","","","","",""]
[null,"","","","","","","","","",""]
[null,"","","","","","","","","",""]
[null,"","","","","","","","","",""]
[null,"","","","","","","","","",""]
[null,"","","","","","","","","",""]
[null,"","","","","","","","","",""]
[null,"","","","","","","","","",""]
[null,"","","","","","","","","",""]
[null,"","","","","","","","","",""]
[null,"","","","","","","","","",""]
[null,"","","","","","","","","",""]
[null,"","","","","","","","","",""]
[null,"","","","","","","","","",""]
[null,"","","","","","","","","",""]
[null,"","","","","","","","","",""]
[null,"","","","","","","","","",""]
[null,"","","","","","","","","",""]
[null,"","","","","","","","","",""]
[null,"","","","","","","","","",""]
[null,"","","","","","","","","",""]
[null,"","","","","","","","","",""]
[null,"","","","","","","","","",""]
[null,"","","","","","","","","",""]
[null,"","","","","","","","","",""]
[null,"","","","","","","","","",""]
[null,"","","","","","","","","",""]
[null,"","","","","","","","","",""]
[null,"","","","","","","","","",""]
[null,"","","","","","","","","",""]
[null,"","","","","","","","","",""]
[null,"","","","","","","","","",""]
[null,"","","","","","","","","",""]
[null,"","","","","","","","","",""]
[null,"","","","","","","","","",""]
[null,"","","","","","","","","",""]
[null,"","","","","","","","","",""]
[null,"","","","","","","","","",""]
[null,"","","","","","","","","",""]
[null,"","","","","","","","","",""]
[null,"","","","","","","","","",""]
[null,"","","","","","","","","",""]
[null,"","","","","","","","","",""]
[null,"","","","","","","","","",""]
[null,"","","","","","","","","",""]
[null,"","","","","","","","","",""]
[null,"","","","","","","","","",""]
[null,"","","","","","","","","",""]
[null,"","","","","","","","","",""]
[null,"","","","","","","","","",""]
[null,"","","","","","","","","",""]
[null,"","","","","","","","","",""]
[null,"","","","","","","","","",""]
[null,"","","","","","","","","",""]
[null,"","","","","","","","","",""]
[null,"","","","","","","","","",""]
[null,"","","",{"$f":"IF(D222<>\"\",F222+H222,\"\")","v":""},"","",{"$f":"IF(D222<>\"\",pret*tauxassurance/100/12,\"\")","v":""},"","",""]
[null,{"$f":"IF(AND(D223<>\"\",OR(typediffere=2,typediffere=3),D222<dureediffere),\"D\",D223)","v":""},{"$f":"IF(D223<>\"\",DATE(YEAR(C222),MONTH(C222)+1,DAY(C222)),\"\")","v":""},{"$f":"IF(AND(D222>0,D222<dureepret),D222+1,\"\")","v":""},"",{"$f":"IF(AND(D223<>\"\",B223=D223,typediffere=1),(pret*tauxinteret/100)/(12*(1-POWER(1+((tauxinteret/100)/12),-dureepret))),IF(AND(D223<>\"\",B223=D223,typediffere=2),(pret*tauxinteret/100)/(12*(1-POWER(1+((tauxinteret/100)/12),-dureepret+dureediffere))),IF(AND(D223<>\"\",B223=\"D\",typediffere=2),G223,IF(AND(D223<>\"\",B223=\"D\",typediffere=3),0,IF(AND(D223<>\"\",B223=D223,B222=\"D\",typediffere=3),(J222*tauxinteret/100)/(12*(1-POWER(1+((tauxinteret/100)/12),-dureepret+dureediffere))),IF(AND(D223<>\"\",B223=D223,B222<>\"D\",typediffere=3),F222,\"\"))))))","v":""},{"$f":"IF(D223<>\"\",J222*tauxinteret/100/12,\"\")","v":""},"",{"$f":"IF(AND(D223<>\"\",B223=D223),F223-G223,IF(AND(D223<>\"\",B223=\"D\"),0,\"\"))","v":""},{"$f":"IF(OR(AND(D223<>\"\",B223=D223),AND(D223<>\"\",B223=\"D\",typediffere=2)),J222-F223+G223,IF(AND(D223<>\"\",B223=\"D\",typediffere=3),J222+G223,\"\"))","v":""},{"$f":"IF(D223<>\"\",K222+G223,\"\")","v":""}]
[null,"","","","","","","","","",""]
[null,"","","","","","","","","",""]
[null,"","","","","","","","","",""]
[null,"","","","","","","","","",""]
[null,"","","","","","","","","",""]
[null,"","","","","","","","","",""]
[null,"","","","","","","","","",""]
[null,"","","","","","","","","",""]
[null,"","","","","","","","","",""]
[null,"","","","","","","","","",""]
[null,"","","","","","","","","",""]
[null,"","","","","","","","","",""]
[null,"","","","","","","","","",""]
[null,"","","","","","","","","",""]
[null,"","","","","","","","","",""]
[null,"","","","","","","","","",""]
[null,"","","","","","","","","",""]
[null,"","","","","","","","","",""]
[null,"","","","","","","","","",""]
[null,"","","","","","","","","",""]
[null,"","","","","","","","","",""]
[null,"","","","","","","","","",""]
[null,"","","","","","","","","",""]
[null,"","","","","","","","","",""]
[null,"","","","","","","","","",""]
[null,"","","","","","","","","",""]
[null,"","","","","","","","","",""]
[null,"","","","","","","","","",""]
[null,"","","","","","","","","",""]
[null,"","","","","","","","","",""]
[null,"","","","","","","","","",""]
[null,"","","","","","","","","",""]
[null,"","","","","","","","","",""]
[null,"","","","","","","","","",""]
[null,"","","","","","","","","",""]
[null,"","","","","","","","","",""]
[null,"","","","","","","","","",""]
[null,"","","","","","","","","",""]
[null,"","","","","","","","","",""]
[null,"","","","","","","","","",""]
[null,"","","","","","","","","",""]
[null,"","","","","","","","","",""]
[null,"","","","","","","","","",""]
[null,"","","","","","","","","",""]
[null,"","","","","","","","","",""]
[null,"","","","","","","","","",""]
[null,"","","","","","","","","",""]
[null,"","","","","","","","","",""]
[null,"","","","","","","","","",""]
[null,"","","","","","","","","",""]
[null,"","","","","","","","","",""]
[null,"","","","","","","","","",""]
[null,"","","","","","","","","",""]
[null,"","","","","","","","","",""]
[null,"","","","","","","","","",""]
[null,"","","","","","","","","",""]
[null,"","","","","","","","","",""]
[null,"","","","","","","","","",""]
[null,"","","","","","","","","",""]
[null,"","","","","","","","","",""]
[null,"","","","","","","","","",""]
[null,"","","","","","","","","",""]
[null,"","","",{"$f":"IF(D286<>\"\",F286+H286,\"\")","v":""},"","",{"$f":"IF(D286<>\"\",pret*tauxassurance/100/12,\"\")","v":""},"","",""]
[null,{"$f":"IF(AND(D287<>\"\",OR(typediffere=2,typediffere=3),D286<dureediffere),\"D\",D287)","v":""},{"$f":"IF(D287<>\"\",DATE(YEAR(C286),MONTH(C286)+1,DAY(C286)),\"\")","v":""},{"$f":"IF(AND(D286>0,D286<dureepret),D286+1,\"\")","v":""},"",{"$f":"IF(AND(D287<>\"\",B287=D287,typediffere=1),(pret*tauxinteret/100)/(12*(1-POWER(1+((tauxinteret/100)/12),-dureepret))),IF(AND(D287<>\"\",B287=D287,typediffere=2),(pret*tauxinteret/100)/(12*(1-POWER(1+((tauxinteret/100)/12),-dureepret+dureediffere))),IF(AND(D287<>\"\",B287=\"D\",typediffere=2),G287,IF(AND(D287<>\"\",B287=\"D\",typediffere=3),0,IF(AND(D287<>\"\",B287=D287,B286=\"D\",typediffere=3),(J286*tauxinteret/100)/(12*(1-POWER(1+((tauxinteret/100)/12),-dureepret+dureediffere))),IF(AND(D287<>\"\",B287=D287,B286<>\"D\",typediffere=3),F286,\"\"))))))","v":""},{"$f":"IF(D287<>\"\",J286*tauxinteret/100/12,\"\")","v":""},"",{"$f":"IF(AND(D287<>\"\",B287=D287),F287-G287,IF(AND(D287<>\"\",B287=\"D\"),0,\"\"))","v":""},{"$f":"IF(OR(AND(D287<>\"\",B287=D287),AND(D287<>\"\",B287=\"D\",typediffere=2)),J286-F287+G287,IF(AND(D287<>\"\",B287=\"D\",typediffere=3),J286+G287,\"\"))","v":""},{"$f":"IF(D287<>\"\",K286+G287,\"\")","v":""}]
[null,"","","","","","","","","",""]
[null,"","","","","","","","","",""]
[null,"","","","","","","","","",""]
[null,"","","","","","","","","",""]
[null,"","","","","","","","","",""]
[null,"","","","","","","","","",""]
[null,"","","","","","","","","",""]
[null,"","","","","","","","","",""]
[null,"","","","","","","","","",""]
[null,"","","","","","","","","",""]
[null,"","","","","","","","","",""]
[null,"","","","","","","","","",""]
[null,"","","","","","","","","",""]
[null,"","","","","","","","","",""]
[null,"","","","","","","","","",""]
[null,"","","","","","","","","",""]
[null,"","","","","","","","","",""]
[null,"","","","","","","","","",""]
[null,"","","","","","","","","",""]
[null,"","","","","","","","","",""]
[null,"","","","","","","","","",""]
[null,"","","","","","","","","",""]
[null,"","","","","","","","","",""]
[null,"","","","","","","","","",""]
[null,"","","","","","","","","",""]
[null,"","","","","","","","","",""]
[null,"","","","","","","","","",""]
[null,"","","","","","","","","",""]
[null,"","","","","","","","","",""]
[null,"","","","","","","","","",""]
[null,"","","","","","","","","",""]
[null,"","","","","","","","","",""]
[null,"","","","","","","","","",""]
[null,"","","","","","","","","",""]
[null,"","","","","","","","","",""]
[null,"","","","","","","","","",""]
[null,"","","","","","","","","",""]
[null,"","","","","","","","","",""]
[null,"","","","","","","","","",""]
[null,"","","","","","","","","",""]
[null,"","","","","","","","","",""]
[null,"","","","","","","","","",""]
[null,"","","","","","","","","",""]
[null,"","","","","","","","","",""]
[null,"","","","","","","","","",""]
[null,"","","","","","","","","",""]
[null,"","","","","","","","","",""]
[null,"","","","","","","","","",""]
[null,"","","","","","","","","",""]
[null,"","","","","","","","","",""]
[null,"","","","","","","","","",""]
[null,"","","","","","","","","",""]
[null,"","","","","","","","","",""]
[null,"","","","","","","","","",""]
[null,"","","","","","","","","",""]
[null,"","","","","","","","","",""]
[null,"","","","","","","","","",""]
[null,"","","","","","","","","",""]
[null,"","","","","","","","","",""]
[null,"","","","","","","","","",""]
[null,"","","","","","","","","",""]
[null,"","","","","","","","","",""]
[null,"","","",{"$f":"IF(D350<>\"\",F350+H350,\"\")","v":""},"","",{"$f":"IF(D350<>\"\",pret*tauxassurance/100/12,\"\")","v":""},"","",""]
[null,{"$f":"IF(AND(D351<>\"\",OR(typediffere=2,typediffere=3),D350<dureediffere),\"D\",D351)","v":""},{"$f":"IF(D351<>\"\",DATE(YEAR(C350),MONTH(C350)+1,DAY(C350)),\"\")","v":""},{"$f":"IF(AND(D350>0,D350<dureepret),D350+1,\"\")","v":""},"",{"$f":"IF(AND(D351<>\"\",B351=D351,typediffere=1),(pret*tauxinteret/100)/(12*(1-POWER(1+((tauxinteret/100)/12),-dureepret))),IF(AND(D351<>\"\",B351=D351,typediffere=2),(pret*tauxinteret/100)/(12*(1-POWER(1+((tauxinteret/100)/12),-dureepret+dureediffere))),IF(AND(D351<>\"\",B351=\"D\",typediffere=2),G351,IF(AND(D351<>\"\",B351=\"D\",typediffere=3),0,IF(AND(D351<>\"\",B351=D351,B350=\"D\",typediffere=3),(J350*tauxinteret/100)/(12*(1-POWER(1+((tauxinteret/100)/12),-dureepret+dureediffere))),IF(AND(D351<>\"\",B351=D351,B350<>\"D\",typediffere=3),F350,\"\"))))))","v":""},{"$f":"IF(D351<>\"\",J350*tauxinteret/100/12,\"\")","v":""},"",{"$f":"IF(AND(D351<>\"\",B351=D351),F351-G351,IF(AND(D351<>\"\",B351=\"D\"),0,\"\"))","v":""},{"$f":"IF(OR(AND(D351<>\"\",B351=D351),AND(D351<>\"\",B351=\"D\",typediffere=2)),J350-F351+G351,IF(AND(D351<>\"\",B351=\"D\",typediffere=3),J350+G351,\"\"))","v":""},{"$f":"IF(D351<>\"\",K350+G351,\"\")","v":""}]
[null,"","","","","","","","","",""]
[null,"","","","","","","","","",""]
[null,"","","","","","","","","",""]
[null,"","","","","","","","","",""]
[null,"","","","","","","","","",""]
[null,"","","","","","","","","",""]
[null,"","","","","","","","","",""]
[null,"","","","","","","","","",""]
[null,"","","","","","","","","",""]
[null,"","","","","","","","","",""]
[null,"","","","","","","","","",""]
[null,"","","","","","","","","",""]
[null,"","","","","","","","","",""]
[null,"","","","","","","","","",""]
[null,"","","","","","","","","",""]
[null,"","","","","","","","","",""]
[null,"","","","","","","","","",""]
[null,"","","","","","","","","",""]
[null,"","","","","","","","","",""]
[null,"","","","","","","","","",""]
[null,"","","","","","","","","",""]
[null,"","","","","","","","","",""]
[null,"","","","","","","","","",""]
[null,"","","","","","","","","",""]
[null,"","","","","","","","","",""]
[null,"","","","","","","","","",""]
[null,"","","","","","","","","",""]
[null,"","","","","","","","","",""]
[null,"","","","","","","","","",""]
[null,"","","","","","","","","",""]
[null,"","","","","","","","","",""]
[null,"","","","","","","","","",""]
[null,"","","","","","","","","",""]
[null,"","","","","","","","","",""]
[null,"","","","","","","","","",""]
[null,"","","","","","","","","",""]
[null,"","","","","","","","","",""]
[null,"","","","","","","","","",""]
[null,"","","","","","","","","",""]
[null,"","","","","","","","","",""]
[null,"","","","","","","","","",""]
[null,"","","","","","","","","",""]
[null,"","","","","","","","","",""]
[null,"","","","","","","","","",""]
[null,"","","","","","","","","",""]
[null,"","","","","","","","","",""]
[null,"","","","","","","","","",""]
[null,"","","","","","","","","",""]
[null,"","","","","","","","","",""]
[null,"","","","","","","","","",""]
[null,"","","","","","","","","",""]
[null,"","","","","","","","","",""]
[null,"","","","","","","","","",""]
[null,"","","","","","","","","",""]
[null,"","","","","","","","","",""]
[null,"","","","","","","","","",""]
[null,"","","","","","","","","",""]
[null,"","","","","","","","","",""]
[null,"","","","","","","","","",""]
[null,"","","","","","","","","",""]
[null,"","","","","","","","","",""]
[null,"","","","","","","","","",""]
[null,"","","",{"$f":"IF(D414<>\"\",F414+H414,\"\")","v":""},"","",{"$f":"IF(D414<>\"\",pret*tauxassurance/100/12,\"\")","v":""},"","",""]
[null,{"$f":"IF(AND(D415<>\"\",OR(typediffere=2,typediffere=3),D414<dureediffere),\"D\",D415)","v":""},{"$f":"IF(D415<>\"\",DATE(YEAR(C414),MONTH(C414)+1,DAY(C414)),\"\")","v":""},{"$f":"IF(AND(D414>0,D414<dureepret),D414+1,\"\")","v":""},"",{"$f":"IF(AND(D415<>\"\",B415=D415,typediffere=1),(pret*tauxinteret/100)/(12*(1-POWER(1+((tauxinteret/100)/12),-dureepret))),IF(AND(D415<>\"\",B415=D415,typediffere=2),(pret*tauxinteret/100)/(12*(1-POWER(1+((tauxinteret/100)/12),-dureepret+dureediffere))),IF(AND(D415<>\"\",B415=\"D\",typediffere=2),G415,IF(AND(D415<>\"\",B415=\"D\",typediffere=3),0,IF(AND(D415<>\"\",B415=D415,B414=\"D\",typediffere=3),(J414*tauxinteret/100)/(12*(1-POWER(1+((tauxinteret/100)/12),-dureepret+dureediffere))),IF(AND(D415<>\"\",B415=D415,B414<>\"D\",typediffere=3),F414,\"\"))))))","v":""},{"$f":"IF(D415<>\"\",J414*tauxinteret/100/12,\"\")","v":""},"",{"$f":"IF(AND(D415<>\"\",B415=D415),F415-G415,IF(AND(D415<>\"\",B415=\"D\"),0,\"\"))","v":""},{"$f":"IF(OR(AND(D415<>\"\",B415=D415),AND(D415<>\"\",B415=\"D\",typediffere=2)),J414-F415+G415,IF(AND(D415<>\"\",B415=\"D\",typediffere=3),J414+G415,\"\"))","v":""},{"$f":"IF(D415<>\"\",K414+G415,\"\")","v":""}]
[null,"","","","","","","","","",""]
[null,"","","","","","","","","",""]
[null,"","","","","","","","","",""]
[null,"","","","","","","","","",""]
[null,"","","","","","","","","",""]
[null,"","","","","","","","","",""]
[null,"","","","","","","","","",""]
[null,"","","","","","","","","",""]
[null,"","","","","","","","","",""]
[null,"","","","","","","","","",""]
[null,"","","","","","","","","",""]
[null,"","","","","","","","","",""]
[null,"","","","","","","","","",""]
[null,"","","","","","","","","",""]
[null,"","","","","","","","","",""]
[null,"","","","","","","","","",""]
[null,"","","","","","","","","",""]
[null,"","","","","","","","","",""]
[null,"","","","","","","","","",""]
[null,"","","","","","","","","",""]
[null,"","","","","","","","","",""]
[null,"","","","","","","","","",""]
[null,"","","","","","","","","",""]
[null,"","","","","","","","","",""]
[null,"","","","","","","","","",""]
[null,"","","","","","","","","",""]
[null,"","","","","","","","","",""]
[null,"","","","","","","","","",""]
[null,"","","","","","","","","",""]
[null,"","","","","","","","","",""]
[null,"","","","","","","","","",""]
[null,"","","","","","","","","",""]
[null,"","","","","","","","","",""]
[null,"","","","","","","","","",""]
[null,"","","","","","","","","",""]
[null,"","","","","","","","","",""]
[null,"","","","","","","","","",""]
[null,"","","","","","","","","",""]
[null,"","","","","","","","","",""]
[null,"","","","","","","","","",""]
[null,"","","","","","","","","",""]
[null,"","","","","","","","","",""]
[null,"","","","","","","","","",""]
[null,"","","","","","","","","",""]
[null,"","","","","","","","","",""]
[null,"","","","","","","","","",""]
[null,"","","","","","","","","",""]
[null,"","","","","","","","","",""]
[null,"","","","","","","","","",""]
[null,"","","","","","","","","",""]
[null,"","","","","","","","","",""]
[null,"","","","","","","","","",""]
[null,"","","","","","","","","",""]
[null,"","","","","","","","","",""]
[null,"","","","","","","","","",""]
[null,"","","","","","","","","",""]
[null,"","","","","","","","","",""]
[null,"","","","","","","","","",""]
[null,"","","","","","","","","",""]
[null,"","","","","","","","","",""]
[null,"","","","","","","","","",""]
[null,"","","","","","","","","",""]
[null,"","","",{"$f":"IF(D478<>\"\",F478+H478,\"\")","v":""},"","",{"$f":"IF(D478<>\"\",pret*tauxassurance/100/12,\"\")","v":""},"","",""]
[null,{"$f":"IF(AND(D479<>\"\",OR(typediffere=2,typediffere=3),D478<dureediffere),\"D\",D479)","v":""},{"$f":"IF(D479<>\"\",DATE(YEAR(C478),MONTH(C478)+1,DAY(C478)),\"\")","v":""},{"$f":"IF(AND(D478>0,D478<dureepret),D478+1,\"\")","v":""},"",{"$f":"IF(AND(D479<>\"\",B479=D479,typediffere=1),(pret*tauxinteret/100)/(12*(1-POWER(1+((tauxinteret/100)/12),-dureepret))),IF(AND(D479<>\"\",B479=D479,typediffere=2),(pret*tauxinteret/100)/(12*(1-POWER(1+((tauxinteret/100)/12),-dureepret+dureediffere))),IF(AND(D479<>\"\",B479=\"D\",typediffere=2),G479,IF(AND(D479<>\"\",B479=\"D\",typediffere=3),0,IF(AND(D479<>\"\",B479=D479,B478=\"D\",typediffere=3),(J478*tauxinteret/100)/(12*(1-POWER(1+((tauxinteret/100)/12),-dureepret+dureediffere))),IF(AND(D479<>\"\",B479=D479,B478<>\"D\",typediffere=3),F478,\"\"))))))","v":""},{"$f":"IF(D479<>\"\",J478*tauxinteret/100/12,\"\")","v":""},"",{"$f":"IF(AND(D479<>\"\",B479=D479),F479-G479,IF(AND(D479<>\"\",B479=\"D\"),0,\"\"))","v":""},{"$f":"IF(OR(AND(D479<>\"\",B479=D479),AND(D479<>\"\",B479=\"D\",typediffere=2)),J478-F479+G479,IF(AND(D479<>\"\",B479=\"D\",typediffere=3),J478+G479,\"\"))","v":""},{"$f":"IF(D479<>\"\",K478+G479,\"\")","v":""}]
[null,"","","","","","","","","",""]
[null,"","","","","","","","","",""]
[null,"","","","","","","","","",""]
[null,"","","","","","","","","",""]
[null,"","","","","","","","","",""]
[null,"","","","","","","","","",""]
[null,"","","","","","","","","",""]
[null,"","","","","","","","","",""]
[null,"","","","","","","","","",""]
[null,"","","","","","","","","",""]
[null,"","","","","","","","","",""]
[null,"","","","","","","","","",""]
[null,"","","","","","","","","",""]
[null,"","","","","","","","","",""]
[null,"","","","","","","","","",""]
[null,"","","","","","","","","",""]
[null,"","","","","","","","","",""]
[null,"","","","","","","","","",""]
[null,"","","","","","","","","",""]
[null,"","","","","","","","","",""]
[null,"","","","","","","","","",""]
[null,"","","","","","","","","",""]
[null,"","","","","","","","","",""]
[null,"","","","","","","","","",""]
[null,"","","","","","","","","",""]
[null,"","","","","","","","","",""]
[null,"","","","","","","","","",""]
[null,"","","","","","","","","",""]
[null,"","","","","","","","","",""]
[null,"","","","","","","","","",""]
[null,"","","","","","","","","",""]
[null,"","","","","","","","","",""]
[null,"","","","","","","","","",""]
[null,"","","","","","","","","",""]
[null,"","","","","","","","","",""]
[null,"","","","","","","","","",""]
[null,"","","","","","","","","",""]
[null,"","","","","","","","","",""]
[null,"","","","","","","","","",""]
[null,"","","","","","","","","",""]
[null,"","","","","","","","","",""]
[null,"","","","","","","","","",""]
[null,"","","","","","","","","",""]
[null,"","","","","","","","","",""]
[null,"","","","","","","","","",""]
[null,"","","","","","","","","",""]
[null,"","","","","","","","","",""]
[null,"","","","","","","","","",""]
[null,"","","","","","","","","",""]
[null,"","","","","","","","","",""]
[null,"","","","","","","","","",""]
[null,"","","","","","","","","",""]
[null,"","","","","","","","","",""]
[null,"","","","","","","","","",""]
[null,"","","","","","","","","",""]
[null,"","","","","","","","","",""]
[null,"","","","","","","","","",""]
[null,"","","","","","","","","",""]
[null,"","","","","","","","","",""]
[null,"","","","","","","","","",""]
[null,"","","","","","","","","",""]
[null,"","","","","","","","","",""]
[null,"","","",{"$f":"IF(D542<>\"\",F542+H542,\"\")","v":""},"","",{"$f":"IF(D542<>\"\",pret*tauxassurance/100/12,\"\")","v":""},"","",""]
[null,{"$f":"IF(AND(D543<>\"\",OR(typediffere=2,typediffere=3),D542<dureediffere),\"D\",D543)","v":""},{"$f":"IF(D543<>\"\",DATE(YEAR(C542),MONTH(C542)+1,DAY(C542)),\"\")","v":""},{"$f":"IF(AND(D542>0,D542<dureepret),D542+1,\"\")","v":""},"",{"$f":"IF(AND(D543<>\"\",B543=D543,typediffere=1),(pret*tauxinteret/100)/(12*(1-POWER(1+((tauxinteret/100)/12),-dureepret))),IF(AND(D543<>\"\",B543=D543,typediffere=2),(pret*tauxinteret/100)/(12*(1-POWER(1+((tauxinteret/100)/12),-dureepret+dureediffere))),IF(AND(D543<>\"\",B543=\"D\",typediffere=2),G543,IF(AND(D543<>\"\",B543=\"D\",typediffere=3),0,IF(AND(D543<>\"\",B543=D543,B542=\"D\",typediffere=3),(J542*tauxinteret/100)/(12*(1-POWER(1+((tauxinteret/100)/12),-dureepret+dureediffere))),IF(AND(D543<>\"\",B543=D543,B542<>\"D\",typediffere=3),F542,\"\"))))))","v":""},{"$f":"IF(D543<>\"\",J542*tauxinteret/100/12,\"\")","v":""},"",{"$f":"IF(AND(D543<>\"\",B543=D543),F543-G543,IF(AND(D543<>\"\",B543=\"D\"),0,\"\"))","v":""},{"$f":"IF(OR(AND(D543<>\"\",B543=D543),AND(D543<>\"\",B543=\"D\",typediffere=2)),J542-F543+G543,IF(AND(D543<>\"\",B543=\"D\",typediffere=3),J542+G543,\"\"))","v":""},{"$f":"IF(D543<>\"\",K542+G543,\"\")","v":""}]
[null,"","","","","","","","","",""]
[null,"","","","","","","","","",""]
[null,"","","","","","","","","",""]
[null,"","","","","","","","","",""]
[null,"","","","","","","","","",""]
[null,"","","","","","","","","",""]
[null,"","","","","","","","","",""]
[null,"","","","","","","","","",""]
[null,"","","","","","","","","",""]
[null,"","","","","","","","","",""]
[null,"","","","","","","","","",""]
[null,"","","","","","","","","",""]
[null,"","","","","","","","","",""]
[null,"","","","","","","","","",""]
[null,"","","","","","","","","",""]
[null,"","","","","","","","","",""]
[null,"","","","","","","","","",""]
[null,"","","","","","","","","",""]
[null,"","","","","","","","","",""]
[null,"","","","","","","","","",""]
[null,"","","","","","","","","",""]
[null,"","","","","","","","","",""]
[null,"","","","","","","","","",""]
[null,"","","","","","","","","",""]
[null,"","","","","","","","","",""]
[null,"","","","","","","","","",""]
[null,"","","","","","","","","",""]
[null,"","","","","","","","","",""]
[null,"","","","","","","","","",""]
[null,"","","","","","","","","",""]
[null,"","","","","","","","","",""]
[null,"","","","","","","","","",""]
[null,"","","","","","","","","",""]
[null,"","","","","","","","","",""]
[null,"","","","","","","","","",""]
[null,"","","","","","","","","",""]
[null,"","","","","","","","","",""]
[null,"","","","","","","","","",""]
[null,"","","","","","","","","",""]
[null,"","","","","","","","","",""]
[null,"","","","","","","","","",""]
[null,"","","","","","","","","",""]
[null,"","","","","","","","","",""]
[null,"","","","","","","","","",""]
[null,"","","","","","","","","",""]
[null,"","","","","","","","","",""]
[null,"","","","","","","","","",""]
[null,"","","","","","","","","",""]
[null,"","","","","","","","","",""]
[null,"","","","","","","","","",""]
[null,"","","","","","","","","",""]
[null,"","","","","","","","","",""]
[null,"","","","","","","","","",""]
[null,"","","","","","","","","",""]
[null,"","","","","","","","","",""]
[null,"","","","","","","","","",""]
[null,"","","","","","","","","",""]
[null,"","","","","","","","","",""]
[null,"","","","","","","","","",""]
[null,"","","","","","","","","",""]
[null,"","","","","","","","","",""]
[null,"","","","","","","","","",""]
[null,"","","",{"$f":"IF(D606<>\"\",F606+H606,\"\")","v":""},"","",{"$f":"IF(D606<>\"\",pret*tauxassurance/100/12,\"\")","v":""},"","",""]
[null,{"$f":"IF(AND(D607<>\"\",OR(typediffere=2,typediffere=3),D606<dureediffere),\"D\",D607)","v":""},{"$f":"IF(D607<>\"\",DATE(YEAR(C606),MONTH(C606)+1,DAY(C606)),\"\")","v":""},{"$f":"IF(AND(D606>0,D606<dureepret),D606+1,\"\")","v":""},"",{"$f":"IF(AND(D607<>\"\",B607=D607,typediffere=1),(pret*tauxinteret/100)/(12*(1-POWER(1+((tauxinteret/100)/12),-dureepret))),IF(AND(D607<>\"\",B607=D607,typediffere=2),(pret*tauxinteret/100)/(12*(1-POWER(1+((tauxinteret/100)/12),-dureepret+dureediffere))),IF(AND(D607<>\"\",B607=\"D\",typediffere=2),G607,IF(AND(D607<>\"\",B607=\"D\",typediffere=3),0,IF(AND(D607<>\"\",B607=D607,B606=\"D\",typediffere=3),(J606*tauxinteret/100)/(12*(1-POWER(1+((tauxinteret/100)/12),-dureepret+dureediffere))),IF(AND(D607<>\"\",B607=D607,B606<>\"D\",typediffere=3),F606,\"\"))))))","v":""},{"$f":"IF(D607<>\"\",J606*tauxinteret/100/12,\"\")","v":""},"",{"$f":"IF(AND(D607<>\"\",B607=D607),F607-G607,IF(AND(D607<>\"\",B607=\"D\"),0,\"\"))","v":""},{"$f":"IF(OR(AND(D607<>\"\",B607=D607),AND(D607<>\"\",B607=\"D\",typediffere=2)),J606-F607+G607,IF(AND(D607<>\"\",B607=\"D\",typediffere=3),J606+G607,\"\"))","v":""},{"$f":"IF(D607<>\"\",K606+G607,\"\")","v":""}]
[null,"","","","","","","","","",""]
[null,"","","","","","","","","",""]
[null,"","","","","","","","","",""]
[null,"","","","","","","","","",""]
[null,"","","","","","","","","",""]
[null,"","","","","","","","","",""]
[null,"","","","","","","","","",""]
[null,"","","","","","","","","",""]
[null,"","","","","","","","","",""]
[null,"","","","","","","","","",""]
[null,"","","","","","","","","",""]
[null,"","","","","","","","","",""]
[null,"","","","","","","","","",""]
[null,"","","","","","","","","",""]
[null,"","","","","","","","","",""]
[null,"","","","","","","","","",""]
[null,"","","","","","","","","",""]
[null,"","","","","","","","","",""]
[null,"","","","","","","","","",""]
[null,"","","","","","","","","",""]
[null,"","","","","","","","","",""]
[null,"","","","","","","","","",""]
[null,"","","","","","","","","",""]
[null,"","","","","","","","","",""]
[null,"","","","","","","","","",""]
[null,"","","","","","","","","",""]
[null,"","","","","","","","","",""]
[null,"","","","","","","","","",""]
[null,"","","","","","","","","",""]
[null,"","","","","","","","","",""]
[null,"","","","","","","","","",""]
[null,"","","","","","","","","",""]
[null,"","","","","","","","","",""]
[null,"","","","","","","","","",""]
[null,"","","","","","","","","",""]
[null,"","","","","","","","","",""]
[null,"","","","","","","","","",""]
[null,"","","","","","","","","",""]
[null,"","","","","","","","","",""]
[null,"","","","","","","","","",""]
[null,"","","","","","","","","",""]
[null,"","","","","","","","","",""]
[null,"","","","","","","","","",""]
[null,"","","","","","","","","",""]
[null,"","","","","","","","","",""]
[null,"","","","","","","","","",""]
[null,"","","","","","","","","",""]
[null,"","","","","","","","","",""]
[null,"","","","","","","","","",""]
[null,"","","","","","","","","",""]
[null,"","","","","","","","","",""]
[null,"","","","","","","","","",""]
[null,"","","","","","","","","",""]
[null,"","","","","","","","","",""]
[null,"","","","","","","","","",""]
[null,"","","","","","","","","",""]
[null,"","","","","","","","","",""]
[null,"","","","","","","","","",""]
[null,"","","","","","","","","",""]
[null,"","","","","","","","","",""]
[null,"","","","","","","","","",""]
[null,"","","","","","","","","",""]
[null,"","","",{"$f":"IF(D670<>\"\",F670+H670,\"\")","v":""},"","",{"$f":"IF(D670<>\"\",pret*tauxassurance/100/12,\"\")","v":""},"","",""]
[null,{"$f":"IF(AND(D671<>\"\",OR(typediffere=2,typediffere=3),D670<dureediffere),\"D\",D671)","v":""},{"$f":"IF(D671<>\"\",DATE(YEAR(C670),MONTH(C670)+1,DAY(C670)),\"\")","v":""},{"$f":"IF(AND(D670>0,D670<dureepret),D670+1,\"\")","v":""},"",{"$f":"IF(AND(D671<>\"\",B671=D671,typediffere=1),(pret*tauxinteret/100)/(12*(1-POWER(1+((tauxinteret/100)/12),-dureepret))),IF(AND(D671<>\"\",B671=D671,typediffere=2),(pret*tauxinteret/100)/(12*(1-POWER(1+((tauxinteret/100)/12),-dureepret+dureediffere))),IF(AND(D671<>\"\",B671=\"D\",typediffere=2),G671,IF(AND(D671<>\"\",B671=\"D\",typediffere=3),0,IF(AND(D671<>\"\",B671=D671,B670=\"D\",typediffere=3),(J670*tauxinteret/100)/(12*(1-POWER(1+((tauxinteret/100)/12),-dureepret+dureediffere))),IF(AND(D671<>\"\",B671=D671,B670<>\"D\",typediffere=3),F670,\"\"))))))","v":""},{"$f":"IF(D671<>\"\",J670*tauxinteret/100/12,\"\")","v":""},"",{"$f":"IF(AND(D671<>\"\",B671=D671),F671-G671,IF(AND(D671<>\"\",B671=\"D\"),0,\"\"))","v":""},{"$f":"IF(OR(AND(D671<>\"\",B671=D671),AND(D671<>\"\",B671=\"D\",typediffere=2)),J670-F671+G671,IF(AND(D671<>\"\",B671=\"D\",typediffere=3),J670+G671,\"\"))","v":""},{"$f":"IF(D671<>\"\",K670+G671,\"\")","v":""}]
[null,"","","","","","","","","",""]
[null,"","","","","","","","","",""]
[null,"","","","","","","","","",""]
[null,"","","","","","","","","",""]
[null,"","","","","","","","","",""]
[null,"","","","","","","","","",""]
[null,"","","","","","","","","",""]
[null,"","","","","","","","","",""]
[null,"","","","","","","","","",""]
[null,"","","","","","","","","",""]
[null,"","","","","","","","","",""]
[null,"","","","","","","","","",""]
[null,"","","","","","","","","",""]
[null,"","","","","","","","","",""]
[null,"","","","","","","","","",""]
[null,"","","","","","","","","",""]
[null,"","","","","","","","","",""]
[null,"","","","","","","","","",""]
[null,"","","","","","","","","",""]
[null,"","","","","","","","","",""]
[null,"","","","","","","","","",""]
[null,"","","","","","","","","",""]
[null,"","","","","","","","","",""]
[null,"","","","","","","","","",""]
[null,"","","","","","","","","",""]
[null,"","","","","","","","","",""]
[null,"","","","","","","","","",""]
[null,"","","","","","","","","",""]
[null,"","","","","","","","","",""]
[null,"","","","","","","","","",""]
[null,"","","","","","","","","",""]
[null,"","","","","","","","","",""]
[null,"","","","","","","","","",""]
[null,"","","","","","","","","",""]
[null,"","","","","","","","","",""]
[null,"","","","","","","","","",""]
[null,"","","","","","","","","",""]
[null,"","","","","","","","","",""]
[null,"","","","","","","","","",""]
[null,"","","","","","","","","",""]
[null,"","","","","","","","","",""]
[null,"","","","","","","","","",""]
[null,"","","","","","","","","",""]
[null,"","","","","","","","","",""]
[null,"","","","","","","","","",""]
[null,"","","","","","","","","",""]
[null,"","","","","","","","","",""]
[null,"","","","","","","","","",""]
[null,"","","","","","","","","",""]
[null,"","","","","","","","","",""]
[null,"","","","","","","","","",""]
[null,"","","","","","","","","",""]
[null,"","","","","","","","","",""]
[null,"","","","","","","","","",""]
[null,"","","","","","","","","",""]
[null,"","","","","","","","","",""]
[null,"","","","","","","","","",""]
[null,"","","","","","","","","",""]
[null,"","","","","","","","","",""]
[null,"","","","","","","","","",""]
[null,"","","","","","","","","",""]
[null,"","","","","","","","","",""]
[null,"","","",{"$f":"IF(D734<>\"\",F734+H734,\"\")","v":""},"","",{"$f":"IF(D734<>\"\",pret*tauxassurance/100/12,\"\")","v":""},"","",""]
[null,{"$f":"IF(AND(D735<>\"\",OR(typediffere=2,typediffere=3),D734<dureediffere),\"D\",D735)","v":""},{"$f":"IF(D735<>\"\",DATE(YEAR(C734),MONTH(C734)+1,DAY(C734)),\"\")","v":""},{"$f":"IF(AND(D734>0,D734<dureepret),D734+1,\"\")","v":""},"",{"$f":"IF(AND(D735<>\"\",B735=D735,typediffere=1),(pret*tauxinteret/100)/(12*(1-POWER(1+((tauxinteret/100)/12),-dureepret))),IF(AND(D735<>\"\",B735=D735,typediffere=2),(pret*tauxinteret/100)/(12*(1-POWER(1+((tauxinteret/100)/12),-dureepret+dureediffere))),IF(AND(D735<>\"\",B735=\"D\",typediffere=2),G735,IF(AND(D735<>\"\",B735=\"D\",typediffere=3),0,IF(AND(D735<>\"\",B735=D735,B734=\"D\",typediffere=3),(J734*tauxinteret/100)/(12*(1-POWER(1+((tauxinteret/100)/12),-dureepret+dureediffere))),IF(AND(D735<>\"\",B735=D735,B734<>\"D\",typediffere=3),F734,\"\"))))))","v":""},{"$f":"IF(D735<>\"\",J734*tauxinteret/100/12,\"\")","v":""},"",{"$f":"IF(AND(D735<>\"\",B735=D735),F735-G735,IF(AND(D735<>\"\",B735=\"D\"),0,\"\"))","v":""},{"$f":"IF(OR(AND(D735<>\"\",B735=D735),AND(D735<>\"\",B735=\"D\",typediffere=2)),J734-F735+G735,IF(AND(D735<>\"\",B735=\"D\",typediffere=3),J734+G735,\"\"))","v":""},{"$f":"IF(D735<>\"\",K734+G735,\"\")","v":""}]
[null,"","","","","","","","","",""]
[null,"","","","","","","","","",""]
[null,"","","","","","","","","",""]
[null,"","","","","","","","","",""]
[null,"","","","","","","","","",""]
[null,"","","","","","","","","",""]
[null,"","","","","","","","","",""]
[null,"","","","","","","","","",""]
[null,"","","","","","","","","",""]
[null,"","","","","","","","","",""]
[null,"","","","","","","","","",""]
[null,"","","","","","","","","",""]
[null,"","","","","","","","","",""]
[null,"","","","","","","","","",""]
[null,"","","","","","","","","",""]
[null,"","","","","","","","","",""]
[null,"","","","","","","","","",""]
[null,"","","","","","","","","",""]
[null,"","","","","","","","","",""]
[null,"","","","","","","","","",""]
[null,"","","","","","","","","",""]
[null,"","","","","","","","","",""]
[null,"","","","","","","","","",""]
[null,"","","","","","","","","",""]
[null,"","","","","","","","","",""]
[null,"","","","","","","","","",""]
[null,"","","","","","","","","",""]
[null,"","","","","","","","","",""]
[null,"","","","","","","","","",""]
[null,"","","","","","","","","",""]
[null,"","","","","","","","","",""]
[null,"","","","","","","","","",""]
[null,"","","","","","","","","",""]
[null,"","","","","","","","","",""]
[null,"","","","","","","","","",""]
[null,"","","","","","","","","",""]
[null,"","","","","","","","","",""]
[null,"","","","","","","","","",""]
[null,"","","","","","","","","",""]
[null,"","","","","","","","","",""]
[null,"","","","","","","","","",""]
[null,"","","","","","","","","",""]
[null,"","","","","","","","","",""]
[null,"","","","","","","","","",""]
[null,"","","","","","","","","",""]
[null,"","","","","","","","","",""]
[null,"","","","","","","","","",""]
[null,"","","","","","","","","",""]
[null,"","","","","","","","","",""]
[null,"","","","","","","","","",""]
[null,"","","","","","","","","",""]
[null,"","","","","","","","","",""]
[null,"","","","","","","","","",""]
[null,"","","","","","","","","",""]
[null,"","","","","","","","","",""]
[null,"","","","","","","","","",""]
[null,"","","","","","","","","",""]
[null,"","","","","","","","","",""]
[null,"","","","","","","","","",""]
[null,"","","","","","","","","",""]
[null,"","","","","","","","","",""]
[null,"","","","","","","","","",""]
[null,"","","",{"$f":"IF(D798<>\"\",F798+H798,\"\")","v":""},"","",{"$f":"IF(D798<>\"\",pret*tauxassurance/100/12,\"\")","v":""},"","",""]
[null,{"$f":"IF(AND(D799<>\"\",OR(typediffere=2,typediffere=3),D798<dureediffere),\"D\",D799)","v":""},{"$f":"IF(D799<>\"\",DATE(YEAR(C798),MONTH(C798)+1,DAY(C798)),\"\")","v":""},{"$f":"IF(AND(D798>0,D798<dureepret),D798+1,\"\")","v":""},"",{"$f":"IF(AND(D799<>\"\",B799=D799,typediffere=1),(pret*tauxinteret/100)/(12*(1-POWER(1+((tauxinteret/100)/12),-dureepret))),IF(AND(D799<>\"\",B799=D799,typediffere=2),(pret*tauxinteret/100)/(12*(1-POWER(1+((tauxinteret/100)/12),-dureepret+dureediffere))),IF(AND(D799<>\"\",B799=\"D\",typediffere=2),G799,IF(AND(D799<>\"\",B799=\"D\",typediffere=3),0,IF(AND(D799<>\"\",B799=D799,B798=\"D\",typediffere=3),(J798*tauxinteret/100)/(12*(1-POWER(1+((tauxinteret/100)/12),-dureepret+dureediffere))),IF(AND(D799<>\"\",B799=D799,B798<>\"D\",typediffere=3),F798,\"\"))))))","v":""},{"$f":"IF(D799<>\"\",J798*tauxinteret/100/12,\"\")","v":""},"",{"$f":"IF(AND(D799<>\"\",B799=D799),F799-G799,IF(AND(D799<>\"\",B799=\"D\"),0,\"\"))","v":""},{"$f":"IF(OR(AND(D799<>\"\",B799=D799),AND(D799<>\"\",B799=\"D\",typediffere=2)),J798-F799+G799,IF(AND(D799<>\"\",B799=\"D\",typediffere=3),J798+G799,\"\"))","v":""},{"$f":"IF(D799<>\"\",K798+G799,\"\")","v":""}]
[null,"","","","","","","","","",""]
[null,"","","","","","","","","",""]
[null,"","","","","","","","","",""]
[null,"","","","","","","","","",""]
[null,"","","","","","","","","",""]
[null,"","","","","","","","","",""]
[null,"","","","","","","","","",""]
[null,"","","","","","","","","",""]
[null,"","","","","","","","","",""]
[null,"","","","","","","","","",""]
[null,"","","","","","","","","",""]
[null,"","","","","","","","","",""]
[null,"","","","","","","","","",""]
[null,"","","","","","","","","",""]
[null,"","","","","","","","","",""]
[null,"","","","","","","","","",""]
[null,"","","","","","","","","",""]
[null,"","","","","","","","","",""]
[null,"","","","","","","","","",""]
[null,"","","","","","","","","",""]
[null,"","","","","","","","","",""]
[null,"","","","","","","","","",""]
[null,"","","","","","","","","",""]
[null,"","","","","","","","","",""]
[null,"","","","","","","","","",""]
[null,"","","","","","","","","",""]
[null,"","","","","","","","","",""]
[null,"","","","","","","","","",""]
[null,"","","","","","","","","",""]
[null,"","","","","","","","","",""]
[null,"","","","","","","","","",""]
[null,"","","","","","","","","",""]
[null,"","","","","","","","","",""]
[null,"","","","","","","","","",""]
[null,"","","","","","","","","",""]
[null,"","","","","","","","","",""]
[null,"","","","","","","","","",""]
[null,"","","","","","","","","",""]
[null,"","","","","","","","","",""]
[null,"","","","","","","","","",""]
[null,"","","","","","","","","",""]
[null,"","","","","","","","","",""]
[null,"","","","","","","","","",""]
[null,"","","","","","","","","",""]
[null,"","","","","","","","","",""]
[null,"","","","","","","","","",""]
[null,"","","","","","","","","",""]
[null,"","","","","","","","","",""]
[null,"","","","","","","","","",""]
[null,"","","","","","","","","",""]
[null,"","","","","","","","","",""]
[null,"","","","","","","","","",""]
[null,"","","","","","","","","",""]
[null,"","","","","","","","","",""]
[null,"","","","","","","","","",""]
[null,"","","","","","","","","",""]
[null,"","","","","","","","","",""]
[null,"","","","","","","","","",""]
[null,"","","","","","","","","",""]
[null,"","","","","","","","","",""]
[null,"","","","","","","","","",""]
[null,"","","","","","","","","",""]
[null,"","","",{"$f":"IF(D862<>\"\",F862+H862,\"\")","v":""},"","",{"$f":"IF(D862<>\"\",pret*tauxassurance/100/12,\"\")","v":""},"","",""]
[null,{"$f":"IF(AND(D863<>\"\",OR(typediffere=2,typediffere=3),D862<dureediffere),\"D\",D863)","v":""},{"$f":"IF(D863<>\"\",DATE(YEAR(C862),MONTH(C862)+1,DAY(C862)),\"\")","v":""},{"$f":"IF(AND(D862>0,D862<dureepret),D862+1,\"\")","v":""},"",{"$f":"IF(AND(D863<>\"\",B863=D863,typediffere=1),(pret*tauxinteret/100)/(12*(1-POWER(1+((tauxinteret/100)/12),-dureepret))),IF(AND(D863<>\"\",B863=D863,typediffere=2),(pret*tauxinteret/100)/(12*(1-POWER(1+((tauxinteret/100)/12),-dureepret+dureediffere))),IF(AND(D863<>\"\",B863=\"D\",typediffere=2),G863,IF(AND(D863<>\"\",B863=\"D\",typediffere=3),0,IF(AND(D863<>\"\",B863=D863,B862=\"D\",typediffere=3),(J862*tauxinteret/100)/(12*(1-POWER(1+((tauxinteret/100)/12),-dureepret+dureediffere))),IF(AND(D863<>\"\",B863=D863,B862<>\"D\",typediffere=3),F862,\"\"))))))","v":""},{"$f":"IF(D863<>\"\",J862*tauxinteret/100/12,\"\")","v":""},"",{"$f":"IF(AND(D863<>\"\",B863=D863),F863-G863,IF(AND(D863<>\"\",B863=\"D\"),0,\"\"))","v":""},{"$f":"IF(OR(AND(D863<>\"\",B863=D863),AND(D863<>\"\",B863=\"D\",typediffere=2)),J862-F863+G863,IF(AND(D863<>\"\",B863=\"D\",typediffere=3),J862+G863,\"\"))","v":""},{"$f":"IF(D863<>\"\",K862+G863,\"\")","v":""}]
[null,"","","","","","","","","",""]
[null,"","","","","","","","","",""]
[null,"","","","","","","","","",""]
[null,"","","","","","","","","",""]
[null,"","","","","","","","","",""]
[null,"","","","","","","","","",""]
[null,"","","","","","","","","",""]
[null,"","","","","","","","","",""]
[null,"","","","","","","","","",""]
[null,"","","","","","","","","",""]
[null,"","","","","","","","","",""]
[null,"","","","","","","","","",""]
[null,"","","","","","","","","",""]
[null,"","","","","","","","","",""]
[null,"","","","","","","","","",""]
[null,"","","","","","","","","",""]
[null,"","","","","","","","","",""]
[null,"","","","","","","","","",""]
[null,"","","","","","","","","",""]
[null,"","","","","","","","","",""]
[null,"","","","","","","","","",""]
[null,"","","","","","","","","",""]
[null,"","","","","","","","","",""]
[null,"","","","","","","","","",""]
[null,"","","","","","","","","",""]
[null,"","","","","","","","","",""]
[null,"","","","","","","","","",""]
[null,"","","","","","","","","",""]
[null,"","","","","","","","","",""]
[null,"","","","","","","","","",""]
[null,"","","","","","","","","",""]
[null,"","","","","","","","","",""]
[null,"","","","","","","","","",""]
[null,"","","","","","","","","",""]
[null,"","","","","","","","","",""]
[null,"","","","","","","","","",""]
[null,"","","","","","","","","",""]
[null,"","","","","","","","","",""]
[null,"","","","","","","","","",""]
[null,"","","","","","","","","",""]
[null,"","","","","","","","","",""]
[null,"","","","","","","","","",""]
[null,"","","","","","","","","",""]
[null,"","","","","","","","","",""]
[null,"","","","","","","","","",""]
[null,"","","","","","","","","",""]
[null,"","","","","","","","","",""]
[null,"","","","","","","","","",""]
[null,"","","","","","","","","",""]
[null,"","","","","","","","","",""]
[null,"","","","","","","","","",""]
[null,"","","","","","","","","",""]
[null,"","","","","","","","","",""]
[null,"","","","","","","","","",""]
[null,"","","","","","","","","",""]
[null,"","","","","","","","","",""]
[null,"","","","","","","","","",""]
[null,"","","","","","","","","",""]
[null,"","","","","","","","","",""]
[null,"","","","","","","","","",""]
[null,"","","","","","","","","",""]
[null,"","","","","","","","","",""]
[null,"","","",{"$f":"IF(D926<>\"\",F926+H926,\"\")","v":""},"","",{"$f":"IF(D926<>\"\",pret*tauxassurance/100/12,\"\")","v":""},"","",""]
[null,{"$f":"IF(AND(D927<>\"\",OR(typediffere=2,typediffere=3),D926<dureediffere),\"D\",D927)","v":""},{"$f":"IF(D927<>\"\",DATE(YEAR(C926),MONTH(C926)+1,DAY(C926)),\"\")","v":""},{"$f":"IF(AND(D926>0,D926<dureepret),D926+1,\"\")","v":""},"",{"$f":"IF(AND(D927<>\"\",B927=D927,typediffere=1),(pret*tauxinteret/100)/(12*(1-POWER(1+((tauxinteret/100)/12),-dureepret))),IF(AND(D927<>\"\",B927=D927,typediffere=2),(pret*tauxinteret/100)/(12*(1-POWER(1+((tauxinteret/100)/12),-dureepret+dureediffere))),IF(AND(D927<>\"\",B927=\"D\",typediffere=2),G927,IF(AND(D927<>\"\",B927=\"D\",typediffere=3),0,IF(AND(D927<>\"\",B927=D927,B926=\"D\",typediffere=3),(J926*tauxinteret/100)/(12*(1-POWER(1+((tauxinteret/100)/12),-dureepret+dureediffere))),IF(AND(D927<>\"\",B927=D927,B926<>\"D\",typediffere=3),F926,\"\"))))))","v":""},{"$f":"IF(D927<>\"\",J926*tauxinteret/100/12,\"\")","v":""},"",{"$f":"IF(AND(D927<>\"\",B927=D927),F927-G927,IF(AND(D927<>\"\",B927=\"D\"),0,\"\"))","v":""},{"$f":"IF(OR(AND(D927<>\"\",B927=D927),AND(D927<>\"\",B927=\"D\",typediffere=2)),J926-F927+G927,IF(AND(D927<>\"\",B927=\"D\",typediffere=3),J926+G927,\"\"))","v":""},{"$f":"IF(D927<>\"\",K926+G927,\"\")","v":""}]
[null,"","","","","","","","","",""]
[null,"","","","","","","","","",""]
[null,"","","","","","","","","",""]
[null,"","","","","","","","","",""]
[null,"","","","","","","","","",""]
[null,"","","","","","","","","",""]
[null,"","","","","","","","","",""]
[null,"","","","","","","","","",""]
[null,"","","","","","","","","",""]
[null,"","","","","","","","","",""]
[null,"","","","","","","","","",""]
[null,"","","","","","","","","",""]
[null,"","","","","","","","","",""]
[null,"","","","","","","","","",""]
[null,"","","","","","","","","",""]
[null,"","","","","","","","","",""]
[null,"","","","","","","","","",""]
[null,"","","","","","","","","",""]
[null,"","","","","","","","","",""]
[null,"","","","","","","","","",""]
[null,"","","","","","","","","",""]
[null,"","","","","","","","","",""]
[null,"","","","","","","","","",""]
[null,"","","","","","","","","",""]
[null,"","","","","","","","","",""]
[null,"","","","","","","","","",""]
[null,"","","","","","","","","",""]
[null,"","","","","","","","","",""]
[null,"","","","","","","","","",""]
[null,"","","","","","","","","",""]
[null,"","","","","","","","","",""]
[null,"","","","","","","","","",""]
[null,"","","","","","","","","",""]
[null,"","","","","","","","","",""]
[null,"","","","","","","","","",""]
[null,"","","","","","","","","",""]
[null,"","","","","","","","","",""]
[null,"","","","","","","","","",""]
[null,"","","","","","","","","",""]
[null,"","","","","","","","","",""]
[null,"","","","","","","","","",""]
[null,"","","","","","","","","",""]
[null,"","","","","","","","","",""]
[null,"","","","","","","","","",""]
[null,"","","","","","","","","",""]
[null,"","","","","","","","","",""]
[null,"","","","","","","","","",""]
[null,"","","","","","","","","",""]
[null,"","","","","","","","","",""]
[null,"","","","","","","","","",""]
[null,"","","","","","","","","",""]
[null,"","","","","","","","","",""]
[null,"","","","","","","","","",""]
[null,"","","","","","","","","",""]
[null,"","","","","","","","","",""]
[null,"","","","","","","","","",""]
[null,"","","","","","","","","",""]
[null,"","","","","","","","","",""]
[null,"","","","","","","","","",""]
[null,"","","","","","","","","",""]
[null,"","","","","","","","","",""]
[null,"","","","","","","","","",""]
[null,"","","",{"$f":"IF(D990<>\"\",F990+H990,\"\")","v":""},"","",{"$f":"IF(D990<>\"\",pret*tauxassurance/100/12,\"\")","v":""},"","",""]
[null,{"$f":"IF(AND(D991<>\"\",OR(typediffere=2,typediffere=3),D990<dureediffere),\"D\",D991)","v":""},{"$f":"IF(D991<>\"\",DATE(YEAR(C990),MONTH(C990)+1,DAY(C990)),\"\")","v":""},{"$f":"IF(AND(D990>0,D990<dureepret),D990+1,\"\")","v":""},"",{"$f":"IF(AND(D991<>\"\",B991=D991,typediffere=1),(pret*tauxinteret/100)/(12*(1-POWER(1+((tauxinteret/100)/12),-dureepret))),IF(AND(D991<>\"\",B991=D991,typediffere=2),(pret*tauxinteret/100)/(12*(1-POWER(1+((tauxinteret/100)/12),-dureepret+dureediffere))),IF(AND(D991<>\"\",B991=\"D\",typediffere=2),G991,IF(AND(D991<>\"\",B991=\"D\",typediffere=3),0,IF(AND(D991<>\"\",B991=D991,B990=\"D\",typediffere=3),(J990*tauxinteret/100)/(12*(1-POWER(1+((tauxinteret/100)/12),-dureepret+dureediffere))),IF(AND(D991<>\"\",B991=D991,B990<>\"D\",typediffere=3),F990,\"\"))))))","v":""},{"$f":"IF(D991<>\"\",J990*tauxinteret/100/12,\"\")","v":""},"",{"$f":"IF(AND(D991<>\"\",B991=D991),F991-G991,IF(AND(D991<>\"\",B991=\"D\"),0,\"\"))","v":""},{"$f":"IF(OR(AND(D991<>\"\",B991=D991),AND(D991<>\"\",B991=\"D\",typediffere=2)),J990-F991+G991,IF(AND(D991<>\"\",B991=\"D\",typediffere=3),J990+G991,\"\"))","v":""},{"$f":"IF(D991<>\"\",K990+G991,\"\")","v":""}]
[null,"","","","","","","","","",""]
[null,"","","","","","","","","",""]
[null,"","","","","","","","","",""]
[null,"","","","","","","","","",""]
[null,"","","","","","","","","",""]
[null,"","","","","","","","","",""]
[null,"","","","","","","","","",""]
[null,"","","","","","","","","",""]
[null,"","","","","","","","","",""]

{"sheet":"Dictionary","index":2,"n_rows":43,"n_cols":7,"rows_kept":43,"cut":false,"hidden":false,"merged":[]}
["Dictionary English","English","Francais","Deutsch","Italiano","Espanol","Portugues"]
["Mortgage calculator","Mortgage calculator","Tableau d'amortissement","Amortisationstabelle","Tabella di ammortamento","Tabla de amortización","Simulador de crédito"]
["Mortgage data","Mortgage data","Données concernant le prêt","Kreditdaten","Dati di prestito","Datos de prestamo","Dados do empréstimo"]
["Start date","Start date","Date de début","Startdatum","Data di inizio","Fecha de inicio","Data de início"]
["Mortgage amount","Mortgage amount","Montant du prêt","Darlehensbetrag","Importo del prestito","Importe del préstamo","Montante do empréstimo"]
["Mortgage term","Mortgage term","Durée","Dauer","Durata","Duración","Prazo"]
["Interest rate per year","Interest rate per year","Taux d'intérêt","Zinssatz","Tasso di interesse","Tasa de interés","Taxa de juros"]
["Insurance rate","Insurance rate","Taux d'assurance","Versicherungspreis","Tasso di assicurazione","Tasa de seguro","Taux d'assurance"]
["% of borrowed amount","% of borrowed amount","% du montant emprunté","% des geliehenen Betrags","% dell'importo preso in prestito","% de la cantidad prestada","% do montante emprestado"]
["Deferred repayment","Deferred repayment","Différé de remboursement","Zurückgestellte Abschreibung","Rimborso differito","Pago diferido","Reembolso diferido"]
["Type","Type","Type de différé","Zurückgestellte Abschreibung","Tipo di differito","Tipo diferido","Tipo de diferido"]
["Duration","Duration","Durée du différé","Dauer","Durata","Duración del diferido","Duração"]
["Without delay","Without delay","Sans Différé","Ohne","Senza","Sin","Sem"]
["Partial (with interest payment)","Partial (with interest payment)","Différé Partiel (avec paiement des intérêts)","Teilweise (mit Zinszahlung)","Partiele (con pagamento degli interessi)","Parcial (con pago de intereses)","Partial (com pagamento de juros)"]
["Total (without interest payment)","Total (without interest payment)","Différé Total (sans paiement des intérêts)","Gesamt (ohne Zinszahlung)","Totale (senza pagamento di interessi)","Total (sin pago de intereses)","Total (sem pagamento de juros)"]
["months","months","mois","Monat(e)","mese","mes","mês"]
["Mortgage cost","Mortgage cost","Coût global du prêt","Gesamtkosten des Darlehens","Costo complessivo del prestito","Costo total del préstamo","Coût global du prêt"]
["Total Interest","Total Interest","Coût des intérêts","Kosten von Interesse","Costo di interesse","Costo de interés","Custo de juros"]
["Total insurance","Total insurance","Coût de l'assurance","Versicherungskosten","Costo dell'assicurazione","Costo del seguro","Custos de seguro"]
["Total cost","Total cost","Coût total du prêt","Gesamtkosten des Darlehens","Costo totale del prestito","Costo total del préstamo","Custo total do empréstimo"]
["£","£","€","€","€","€","€"]
["Amortization schedule calculator","Amortization schedule calculator","Tableau d'amortissement","Amortisationstabelle","Tabella di ammortamento","Tabla de amortización","Simulador de crédito"]
["Date","Date","Date","Datum","Data","Fecha","Data"]
["No.","No.","No. d'échéance","Fälligkeitsnummer","N. pagamento","Cantidad de pagos","Mês"]
["Monthly payment with insurance","Monthly payment with insurance","Mensualité avec assurance","Monatlich mit Versicherung","Mensile con assicurazione","Pago mensual con seguro","Pagamento mensal com seguro"]
["Monthly payment without insurance","Monthly payment without insurance","Mensualité hors assurance","Monatlich Versicherung ausgeschlossen","Mensile esclusa l'assicurazione","Pago mensual sin seguro","Pagamento mensal excluindo seguro"]
["Interest","Interest","Intérêts","Zinsen","Interessi","Intereses","Juros"]
["Insurance","Insurance","Assurance","Versicherung","Assicurazione","Seguro","Seguro"]
["Principal","Principal","Capital remboursé","Kapital zurückerstattet","Capitale rimborsato","Capital pagado","Capital peembolsado"]
["Balance","Balance","Capital restant dû","Kapital fällig bleiben","Capitale rimanente","Capital restante","Capital restante"]
["Total Interest\t","Total Interest\t","Cumul des intérêts","Kumulierte Zinsen","Interesse cumulativo","Interés acumulado","Juros acumulados"]
["January","January","Janvier","Januar ","gennaio","enero","janeiro "]
["February","February","Février","Februar ","febbraio","febrero","fevereiro "]
["March","March","Mars","März ","marzo","marzo","março"]
["April","April","Avril","April ","aprile","abril","abril"]
["May","May","Mai","Mai ","maggio","mayo","maio"]
["June","June","Juin","Juni ","giugno","junio","junho"]
["July","July","Juillet","Juli ","luglio","julio","julho"]
["August","August","Aout","August ","agosto","agosto","agosto"]
["September","September","Septembre","September ","settembre","septiembre","setembro"]
["October","October","Octobre ","Oktober ","ottobre","octubre","outubro"]
["November","November","Novembre ","November ","novembre","noviembre","novembro"]
["December","December","Décembre ","Dezember ","dicembre","diciembre","dezembro"]

{"sheet":"Month mapping","index":3,"n_rows":12,"n_cols":2,"rows_kept":12,"cut":false,"hidden":true,"merged":[]}
[1,"Jan"]
[2,"Feb"]
[3,"Mar"]
[4,"Apr"]
[5,"May"]
[6,"Jun"]
[7,"Jul"]
[8,"Aug"]
[9,"Sep"]
[10,"Oct"]
[11,"Nov"]
[12,"Dec"]